program: Gaussian 09
title: 000230748
version: EM64L-G09RevD.01
frameworkgroup: C1[X(C20H12O2)]
method: RPBEPBE
basis: SDD
operation: Freq
keyword: #pfreq=noraman
keyword: PBEPBE/SDD
title: #p freq=noraman PBEPBE/SDD
converged: YES YES YES YES
title: Mulliken charges:
elementType: O O C C C C C C C C C C C C C C C C C C C C H H H H H H H H H H H H
charge: -0.179978 -0.179978 -0.766563 -0.766563 0.309774 0.309773 0.408095 0.408103 0.408103 0.408096 -0.035930 -0.035930 -0.451380 -0.451377 -0.451380 -0.451377 -0.272601 -0.272601 -0.235542 -0.235541 -0.235539 -0.235545 0.289162 0.289162 0.247255 0.247255 0.247255 0.247255 0.262557 0.262557 0.228356 0.228355 0.228357 0.228355
chargesum: 0.00000
title: Mulliken charges with hydrogens summed into heavy atoms:
elementType: O O C C C C C C C C C C C C C C C C C C C C
charge: -0.179978 -0.179978 -0.477401 -0.477401 0.309774 0.309773 0.408095 0.408103 0.408103 0.408096 -0.035930 -0.035930 -0.204125 -0.204122 -0.204125 -0.204122 -0.010044 -0.010044 -0.007186 -0.007186 -0.007183 -0.007190
polarizability: 1.88588055e+02 -9.91927193e-03 2.04063361e+02 1.72760312e-04 -2.17776451e-03 2.29667511e+02
1716.lowfreq: -11.3824 -9.7425 -0.0005 -0.0004 0.0001 7.2555 58.2552 63.8228 64.2886
frequency: 58.2551 63.8228 64.2804 97.2018 138.5040 139.8407 165.5374 205.0866 277.3551 281.9688 291.5513 346.5877 367.6033 368.5318 424.2754 446.3358 452.5127 458.7103 478.4520 506.0369 523.8874 563.3044 580.5627 588.6079 619.3060 632.3203 643.3761 650.9111 706.5921 740.6910 748.6634 752.9982 775.8589 776.9998 780.0939 793.9861 805.1096 852.2250 853.4803 859.2985 888.1083 898.4239 943.7443 946.9987 984.4048 985.6905 986.2778 988.4206 992.5109 1022.1710 1022.4786 1075.3937 1098.5460 1112.4207 1134.5272 1145.9683 1146.7669 1168.2380 1172.2812 1182.5988 1201.0721 1201.2512 1208.1841 1216.5328 1220.7348 1289.5383 1307.5596 1314.3702 1332.3896 1359.0293 1390.1718 1395.9892 1443.8372 1444.9964 1455.7427 1469.3596 1521.1315 1547.6479 1584.3572 1595.4236 1601.3512 1603.7622 1613.8314 1634.4415 3092.3414 3096.0855 3125.5705 3125.7450 3132.6341 3132.8746 3142.1979 3145.0855 3145.3838 3163.7118 3164.0424 3167.8223
redmass: 5.6786 5.2195 10.2696 8.2391 3.8325 4.5186 5.6816 6.1453 4.6534 9.0427 5.7126 4.2286 4.4865 4.3154 6.7066 3.6890 8.1014 5.8919 7.0757 5.3632 4.4841 4.0931 3.5048 4.3474 5.7922 5.4192 3.5466 6.3378 3.3448 6.6287 5.0297 1.5641 2.1294 1.7197 4.7397 3.5100 7.2880 2.1115 2.2636 2.3247 2.0103 2.2176 1.4005 1.4265 3.8082 1.3208 1.4541 3.4161 1.3017 2.2861 2.3842 3.0751 2.8815 3.2063 1.3109 2.0720 2.2050 1.3091 1.0752 1.8442 1.2063 2.5791 1.5555 1.4962 1.5501 1.5243 4.5804 1.3320 1.6815 3.5855 7.2258 7.3527 2.3833 2.3587 2.2054 2.6933 11.9922 9.8227 7.3430 6.2537 7.4174 6.9874 7.2492 8.0080 1.0878 1.0891 1.0856 1.0855 1.0899 1.0899 1.0868 1.0946 1.0946 1.1004 1.1004 1.1006
irintensity: 0.1942 0.9861 0.0000 11.7549 0.0000 0.1046 0.3208 1.1732 0.0000 2.4622 0.0023 2.8455 0.1837 0.0000 11.4163 3.2317 2.6351 0.0344 0.0000 51.4063 0.0000 0.0561 6.3284 0.0000 0.0000 13.9586 2.9061 0.0731 27.1585 7.7761 0.0000 19.2192 30.7948 47.6548 0.3267 11.9344 0.0000 51.6111 0.9416 0.0000 0.0000 0.1379 0.2763 0.1210 4.4065 0.0000 0.7709 52.8496 0.0001 7.2425 4.7534 0.0000 1.7396 3.3474 18.3495 0.0000 18.9605 1.4692 0.0629 3.9854 0.0000 0.3191 0.9045 23.7558 61.9199 5.6702 81.2135 0.0000 9.2449 11.5672 0.0700 0.2670 10.8183 0.0000 39.8654 27.4787 34.8916 244.4287 73.5185 2.1879 4.4477 0.0000 0.2430 20.1644 5.1181 1.2449 0.0000 1.3990 3.6426 1.1664 0.5868 0.0000 45.1503 49.4240 16.6747 11.1884
temp: 298.150 k
press: 1.00000 atm
elementType: 8 8 6 6 6 6 6 6 6 6 6 6 6 6 6 6 6 6 6 6 6 6 1 1 1 1 1 1 1 1 1 1 1 1
symmnumber: 1
zpe: 672079.3 jmol-1
zpe.correction: 0.255982 hartree
zpe.thermalcorrener: 0.271527 hartree
zpe.thermalcorrenthalpy: 0.272472 hartree
zpe.thermalcorrgfe: 0.213312 hartree
zpe.sumelectzpe: -918.295778 hartree
zpe.sumelectthermal: -918.280232 hartree
zpe.sumelectthermalent: -918.279288 hartree
zpe.sumelectthermalfe: -918.338448 hartree
dipole: 1.1404 -0.0020 0.0000
dipole: 1.1404
quadrupole: -118.5304 -116.6969 -131.4247
quadrupole: 0.0048 0.0000 0.0003
quadrupole: 3.6869 5.5204 -9.2074 0.0048 0.0000 0.0003
hfenergy: -918.5517599 hartree
pointgroup: C01 [X(C20H12O2)]
dipole: -0.4486525 -0.001506 -0.0000259 debye
polarizability: 188.5880638|-0.0150503|204.0633557|-0.0021137|-0.0095704|229.6675073 unknown
InChI: InChI=1S/C20H12O2/c21-15-9-10-16(22)20-18-12-6-2-1-5-11(12)17(19(15)20)13-7-3-4-8-14(13)18/h1-10,17-18H
charge 0 multiplicity 1
34 atoms
O  2.426134 0.002799 2.742228
O  2.42643 0.005113 -2.741921
C  -0.238646 -0.000899 1.313094
C  -0.238503 0.000244 -1.313082
C  1.156858 0.001196 0.687957
C  1.156933 0.001776 -0.68779
C  -0.952647 -1.228416 0.709573
C  -0.955849 1.225274 0.710641
C  -0.952568 -1.227797 -0.710709
C  -0.955775 1.225891 -0.70964
C  2.414554 0.002615 1.467963
C  2.414714 0.003504 -1.467658
C  -1.568721 -2.269691 1.423881
C  -1.574662 2.264302 1.425851
C  -1.568559 -2.268455 -1.425988
C  -1.574524 2.265532 -1.424015
C  3.687809 0.004619 0.683807
C  3.687884 0.005216 -0.683362
C  -2.193003 -3.32248 0.705195
C  -2.201725 3.316067 0.708081
C  -2.192922 -3.321868 -0.708284
C  -2.201657 3.316677 -0.705399
H  -0.20415 -0.001327 2.412696
H  -0.203886 0.000767 -2.41268
H  -1.566056 -2.270995 2.519738
H  -1.571994 2.264655 2.521708
H  -1.565772 -2.268811 -2.521845
H  -1.571746 2.266832 -2.519871
H  4.6135 0.005681 1.270401
H  4.613637 0.006831 -1.269856
H  -2.675401 -4.14136 1.250333
H  -2.686271 4.133202 1.253931
H  -2.67526 -4.140274 -1.254184
H  -2.686155 4.134279 -1.250593
