program: Gaussian 09
title: 000230743
version: EM64L-G09RevD.01
frameworkgroup: C1[X(C7H10N4)]
method: RPBEPBE
basis: SDD
operation: Freq
keyword: #pfreq=noraman
keyword: PBEPBE/SDD
title: #p freq=noraman PBEPBE/SDD
converged: YES YES NO NO
title: Mulliken charges:
elementType: N N N N C C C C C C C H H H H H H H H H H
charge: -0.078468 -0.124228 -0.638685 -0.596212 -0.439977 -0.544459 -0.488765 0.116238 0.033870 0.142281 -0.039810 0.224531 0.225008 0.223243 0.222501 0.236784 0.236919 0.321371 0.323467 0.323906 0.320485
chargesum: 0.00000
title: Mulliken charges with hydrogens summed into heavy atoms:
elementType: N N N N C C C C C C C
charge: -0.078468 -0.124228 0.006153 0.048179 0.009562 -0.098716 -0.015063 0.116238 0.033870 0.142281 -0.039810
polarizability: 1.33139099e+02 -5.92147252e+00 1.19901436e+02 -1.68867338e-02 -8.67296298e-03 5.51113082e+01
1716.lowfreq: -107.2718 -12.4273 -4.4706 -2.4989 -0.0009 0.0004 0.0009 108.9810 164.4303
frequency: -107.2681 108.9730 164.4302 218.7869 257.3445 266.0609 307.2118 366.2055 417.6848 474.6394 498.0686 507.7013 524.4396 564.9262 572.1811 590.2650 696.3410 718.4454 754.9114 773.1411 779.2460 895.0039 909.7179 918.4923 981.7294 1032.3724 1038.0088 1073.9099 1121.0539 1138.3858 1194.2427 1198.8485 1234.1147 1238.2286 1275.0555 1305.1830 1321.7818 1393.3435 1435.6066 1459.6930 1468.3363 1475.8645 1486.9479 1561.4617 1575.4954 1598.2662 1619.1375 2955.9337 2994.7334 2999.8664 3023.1126 3046.2086 3081.4931 3553.8237 3567.0928 3711.4140 3728.2842
redmass: 1.6082 2.9658 3.5959 5.6595 3.2379 3.6353 2.8082 1.2151 1.2030 5.9649 3.6380 1.1358 1.0757 2.9009 4.4317 6.4407 7.3729 5.6046 1.1688 7.6193 5.9430 3.6635 1.4964 2.3626 3.3180 3.1422 1.7369 2.9225 2.0914 1.1900 1.2137 2.7604 1.1117 1.3109 2.2078 1.6777 3.2132 5.8847 3.6419 1.2140 1.1079 3.0140 1.1017 3.8712 4.4164 1.5625 1.6375 1.0585 1.1032 1.0596 1.0620 1.1024 1.1047 1.0447 1.0438 1.1044 1.1059
irintensity: 0.3923 0.5108 10.5817 5.1244 2.9476 5.5673 8.8773 183.2629 326.3412 2.1885 3.4128 57.3255 14.9350 22.5151 1.4025 0.9695 0.7966 1.5607 10.5505 23.8894 0.1209 1.5630 0.6251 1.6400 5.7633 7.1900 0.1890 5.1099 1.6078 0.1849 0.0112 0.0328 0.1742 0.9352 5.3428 7.0099 12.5881 5.2308 176.3780 71.8278 17.8391 59.1584 6.9648 215.4275 107.5770 651.2246 297.2670 56.9346 23.9308 26.6267 64.5556 2.4093 50.8112 69.2546 93.8945 30.3485 42.2352
temp: 298.150 k
press: 1.00000 atm
elementType: 7 7 7 7 6 6 6 6 6 6 6 1 1 1 1 1 1 1 1 1 1
symmnumber: 1
zpe: 449635.9 jmol-1
zpe.correction: 0.171257 hartree
zpe.thermalcorrener: 0.180325 hartree
zpe.thermalcorrenthalpy: 0.181269 hartree
zpe.thermalcorrgfe: 0.137555 hartree
zpe.sumelectzpe: -490.969896 hartree
zpe.sumelectthermal: -490.960828 hartree
zpe.sumelectthermalent: -490.959884 hartree
zpe.sumelectthermalfe: -491.003597 hartree
dipole: -0.9870 2.1246 -0.0220
dipole: 2.3427
quadrupole: -53.0153 -56.0534 -67.4839
quadrupole: -3.3397 -0.0699 -0.0096
quadrupole: 5.8356 2.7974 -8.6331 -3.3397 -0.0699 -0.0096
hfenergy: -491.1411529 hartree
pointgroup: C01 [X(C7H10N4)]
dipole: 0.40466 -0.8278085 -0.0228759 debye
dipolederiv: -1.3385434 0.3337635 -0.0133677 -0.2474612 -0.5366333 -0.0123802 -0.0290808 -0.0009825 -0.2519558 -0.8882368 0.2972342 -0.0047316 0.4841233 -0.9741236 -0.0094087 0.0004345 -0.0135923 -0.278088 -0.1796661 0.0757544 0.0118194 0.035221 -1.4762 -0.0183963 0.010601 -0.0144831 -0.7287502 -1.485397 0.5222533 0.0017063 0.4876811 -0.3462233 0.0202679 0.0057123 0.0190365 -0.7463004 0.1145 0.046823 0.001885 0.0177967 0.0158533 -0.0031159 -0.0014466 -0.0031892 0.155174 0.0890368 -0.0597641 -0.0044554 -0.0107586 0.04978 -0.0040298 -0.004672 -0.0050304 0.229039 -0.1215346 -0.0520354 -0.0067626 -0.180581 -0.0265144 -0.0085169 -0.0112136 -0.0063445 0.1312294 -0.2630713 -0.3572706 -0.0128066 -0.169296 -0.9225954 -0.0265818 -0.004376 -0.0305679 -0.0918405 0.8048337 -0.2070871 0.0109165 0.0530622 0.7871917 0.0226003 0.0188826 0.0190611 0.0002792 0.7021485 0.0595789 0.0121606 -0.0784306 1.8364721 0.0422724 0.0078193 0.0452319 0.2116965 1.9387064 -0.5903282 0.0184452 -0.4572265 0.7744908 0.0067389 0.0217023 0.0037914 0.1972508 -0.051767 -0.0195248 -0.10206 -0.0143587 0.054849 -0.0153773 -0.1634019 -0.0280795 -0.0696242 -0.0550529 -0.0244455 0.1000484 -0.022098 0.0517301 0.0208133 0.1626172 0.033408 -0.0623849 -0.0381416 0.037305 -0.0398567 0.0637095 -0.0374139 0.1048337 -0.1018157 0.1261987 -0.0671163 -0.0429805 0.0408818 0.0430513 0.0648871 -0.0293608 -0.1011848 0.1059083 -0.1230493 -0.0693225 0.0309865 -0.0178504 0.0038443 0.0042901 -0.0250004 0.095855 0.0323896 0.1390957 -0.0298984 0.0312837 -0.0130743 -0.0019409 0.0102091 -0.0097524 -0.0940298 -0.0286971 -0.1382944 -0.0467896 0.1239182 -0.0196262 -0.0046382 0.00597 0.2426181 -0.0034498 -0.0033291 -0.0060686 0.3677276 0.1589184 0.0164743 -0.0038773 0.0130203 0.2286654 -0.0040522 -0.0041684 -0.0049999 0.3727706 0.2184673 -0.0472602 -0.0051508 -0.069963 0.1967664 -0.0059644 -0.0078546 -0.0041581 0.3874575 0.2515918 -0.0218016 -0.0042293 0.0102034 0.1454006 -0.0068937 -0.0060112 -0.0069837 0.3894466 unknown
polarizability: 133.3326634|-5.698651|119.6339404|1.4419496|1.637319|55.1852399 unknown
InChI: InChI=1S/C7H10N4/c8-6-4-2-1-3-5(4)10-7(9)11-6/h1-3,8-9H2
charge 0 multiplicity 1
21 atoms
N  -0.79702 1.440656 0.002707
N  -1.691554 -0.850389 -0.078728
N  -0.301184 -2.733499 -0.100495
N  -3.103107 1.016531 -0.055298
C  2.875322 0.626063 0.048231
C  2.19628 -0.796604 0.006416
C  1.731337 1.695993 0.062886
C  0.713778 -0.493003 -0.019506
C  0.449438 0.88893 0.01268
C  -0.417546 -1.356604 -0.065911
C  -1.81791 0.514954 -0.04353
H  3.513451 0.721493 0.943488
H  3.529006 0.764946 -0.829966
H  2.48375 -1.400329 0.891384
H  2.524029 -1.366856 -0.886583
H  1.786478 2.385685 -0.799554
H  1.753682 2.326942 0.970641
H  0.607081 -3.186667 -0.098756
H  -1.152803 -3.289352 -0.133827
H  -3.234431 2.023423 -0.034572
H  -3.888177 0.373886 -0.093905
