program: Gaussian 09
title: 000230736
version: EM64L-G09RevD.01
frameworkgroup: C1[X(C10H22O)]
method: RPBEPBE
basis: SDD
operation: Freq
keyword: #pfreq=noraman
keyword: PBEPBE/SDD
title: #p freq=noraman PBEPBE/SDD
converged: YES YES NO NO
title: Mulliken charges:
elementType: O C C C C C C C C C C H H H H H H H H H H H H H H H H H H H H H H
charge: -0.445669 0.340519 -0.106316 0.353826 -0.517014 -0.734294 -0.751273 -0.764546 -0.744490 -0.747132 -0.727467 0.221916 0.205649 0.215347 0.203628 0.249361 0.202918 0.211833 0.213285 0.216211 0.220015 0.218126 0.211800 0.201776 0.258242 0.192170 0.228270 0.209656 0.207117 0.207847 0.207300 0.212902 0.328484
chargesum: 0.00000
title: Mulliken charges with hydrogens summed into heavy atoms:
elementType: O C C C C C C C C C C
charge: -0.117185 0.340519 0.115601 0.353826 -0.096017 -0.078387 -0.109944 -0.114605 -0.092302 -0.102089 -0.099418
polarizability: 1.25399550e+02 2.43213977e-01 1.06106613e+02 -1.19268392e+00 -1.58844770e+00 1.04351510e+02
1716.lowfreq: -34.1121 -18.7950 -14.6615 -3.9754 -0.0005 -0.0003 -0.0002 59.5087 80.3294
frequency: -19.6051 59.4553 79.4579 140.3174 200.2068 209.6711 219.9731 236.1141 245.9442 251.8734 258.7848 277.5020 280.8904 282.2948 309.5273 327.8096 348.8064 367.3900 383.3485 391.5073 421.4702 467.8431 517.6043 531.7376 728.2987 763.1176 820.8390 884.1107 905.7060 919.9657 924.4005 926.4429 927.3856 937.0855 940.7605 951.6945 1007.4391 1010.3647 1022.7104 1031.8079 1084.9012 1123.7191 1176.6051 1211.5376 1223.8958 1243.5410 1248.8956 1253.6975 1298.6937 1314.7024 1348.5022 1354.2477 1369.6715 1369.7780 1371.8872 1375.2717 1397.9014 1399.7128 1439.0587 1455.1084 1458.6571 1464.0967 1465.9641 1469.0215 1471.6570 1478.0619 1481.5785 1485.4373 1490.0821 1496.9297 1498.3869 2944.9083 2959.2599 2962.4847 2966.8873 2968.0393 2969.3651 2973.6023 3013.0263 3027.9729 3048.2229 3056.0205 3057.1365 3057.4387 3061.1071 3063.5953 3064.8124 3067.1483 3070.5942 3071.2173 3090.8527 3091.3863 3556.9657
redmass: 2.8417 2.9169 2.4684 2.8895 1.0976 1.2352 1.6946 1.2790 1.1696 1.3178 1.1185 1.4355 2.1033 2.2853 1.3931 2.1060 2.1351 2.2615 2.3277 1.9157 2.3509 2.5677 2.5691 2.5757 3.9040 3.2570 2.7408 2.1164 2.1183 1.7650 1.6167 1.5677 1.6394 1.2205 1.2879 2.1284 1.4454 1.3963 1.4418 1.4006 2.8393 1.2034 1.7627 2.4662 2.8491 2.8100 2.3319 3.0667 1.6238 1.3761 1.4466 1.1984 1.2116 1.2124 1.2050 1.2124 1.2129 1.2141 1.0870 1.0506 1.0504 1.0506 1.0492 1.0476 1.0503 1.0569 1.0544 1.0573 1.0562 1.0592 1.0579 1.0634 1.0351 1.0362 1.0355 1.0355 1.0375 1.0368 1.0872 1.0925 1.0988 1.0994 1.0995 1.0996 1.0990 1.0990 1.0984 1.0982 1.0982 1.0989 1.0986 1.0987 1.0657
irintensity: 0.1126 0.3866 1.8076 0.5094 6.4316 4.5681 4.3556 21.6202 3.8606 11.6875 10.5628 16.7066 37.2657 0.1895 63.8581 7.1194 4.1563 0.7237 1.2587 0.0152 0.0527 2.1983 11.0540 1.0313 1.3342 3.8004 6.4817 19.9376 13.4274 5.7757 3.3482 1.4674 2.3647 0.7751 7.2293 42.1779 0.3193 0.7467 3.5851 17.7045 5.9940 23.3620 8.0345 8.5616 5.3394 35.0055 2.0781 5.0298 10.5566 4.9631 7.6105 17.3565 31.6552 17.2873 21.2704 42.6559 14.8220 10.3613 2.2660 0.3754 1.6494 2.3087 0.8851 2.3391 1.2435 13.0076 4.8308 18.5392 6.3654 16.8020 38.4147 21.4772 30.8643 52.5775 36.0684 45.6009 17.0558 15.6517 8.6793 29.1962 17.0974 23.0793 20.3405 12.6705 50.1812 37.1020 93.8173 67.2371 58.3567 54.0749 23.0485 22.8033 3.8394
temp: 298.150 k
press: 1.00000 atm
elementType: 8 6 6 6 6 6 6 6 6 6 6 1 1 1 1 1 1 1 1 1 1 1 1 1 1 1 1 1 1 1 1 1 1
symmnumber: 1
zpe: 783403.9 jmol-1
zpe.correction: 0.298383 hartree
zpe.thermalcorrener: 0.312636 hartree
zpe.thermalcorrenthalpy: 0.313580 hartree
zpe.thermalcorrgfe: 0.259730 hartree
zpe.sumelectzpe: -468.538136 hartree
zpe.sumelectthermal: -468.523883 hartree
zpe.sumelectthermalent: -468.522939 hartree
zpe.sumelectthermalfe: -468.576789 hartree
dipole: 0.1093 -1.3319 -1.1593
dipole: 1.7691
quadrupole: -72.5600 -75.9473 -71.3889
quadrupole: 1.1457 0.9027 -3.3294
quadrupole: 0.7388 -2.6486 1.9098 1.1457 0.9027 -3.3294
hfenergy: -468.8365189 hartree
pointgroup: C01 [X(C10H22O1)]
dipole: 0.045821 0.5793826 0.3829795 debye
polarizability: 125.4148285|-0.1051329|105.6625354|1.0751339|-1.7621072|104.7803095 unknown
InChI: InChI=1S/C10H22O/c1-9(2,3)7-8(11)10(4,5)6/h8,11H,7H2,1-6H3
charge 0 multiplicity 1
33 atoms
O  -0.493345 -1.792856 0.178661
C  -1.99694 0.208697 0.022969
C  -0.550805 -0.364825 -0.225138
C  2.06499 0.114542 -0.00188
C  0.593626 0.446811 0.421567
C  -2.997649 -0.673657 -0.771663
C  -2.096845 1.666933 -0.50068
C  -2.365844 0.169803 1.529782
C  2.524286 -1.27436 0.519183
C  2.218218 0.159091 -1.545406
C  2.978956 1.204769 0.625205
H  -0.406311 -0.408561 -1.320928
H  0.522119 0.356064 1.527649
H  0.4242 1.516337 0.189532
H  -4.040077 -0.375578 -0.551715
H  -2.867058 -1.737735 -0.51101
H  -2.836813 -0.568238 -1.86201
H  -1.542967 2.38146 0.13521
H  -1.706479 1.749816 -1.533641
H  -3.154992 1.988802 -0.517217
H  -1.673031 0.776864 2.14192
H  -3.383937 0.573701 1.68219
H  -2.364225 -0.866865 1.917585
H  3.588658 -1.443009 0.266183
H  1.922713 -2.084955 0.075629
H  2.43047 -1.334389 1.621687
H  1.671624 -0.668401 -2.032317
H  3.283653 0.064948 -1.828198
H  1.842246 1.114604 -1.960044
H  2.87883 1.2223 1.727755
H  2.723933 2.212314 0.243936
H  4.041299 1.009368 0.3858
H  -0.347804 -1.82769 1.158099
