program: Gaussian 09
title: 000230732
version: EM64L-G09RevD.01
frameworkgroup: C1[X(C14H19NO2)]
method: RPBEPBE
basis: SDD
operation: Freq
keyword: #p
keyword: freq=noraman
keyword: PBEPBE/SDD
title: #p freq=noraman PBEPBE/SDD
converged: NO YES NO NO
title: Mulliken charges:
elementType: O O N C C C C C C C C C C C C C C H H H H H H H H H H H H H H H H H H H
charge: -0.326764 -0.296416 -0.617539 0.189310 -0.069121 -0.474113 -0.462088 -0.430499 -0.389178 0.478776 -0.770754 -0.420194 -0.375633 -0.252147 -0.269808 0.312874 -0.247925 0.258766 0.218905 0.195795 0.208243 0.228043 0.199704 0.199986 0.202116 0.210656 0.225917 0.230715 0.218313 0.247509 0.232518 0.220268 0.225804 0.226358 0.334315 0.337288
chargesum: 0.00000
title: Mulliken charges with hydrogens summed into heavy atoms:
elementType: O O N C C C C C C C C C C C C C C
charge: -0.326764 -0.296416 0.054063 0.189310 0.189645 -0.059413 -0.025802 -0.030808 0.023595 0.478776 -0.095809 -0.172685 -0.143115 -0.031879 -0.044004 0.312874 -0.021568
polarizability: 1.79669795e+02 -1.36601624e+01 1.43737276e+02 7.16534571e+00 1.14748361e+01 1.40809721e+02
1716.lowfreq: -21.7095 -7.0512 -4.3808 -0.0004 0.0004 0.0008 11.1033 28.1704 50.8265
frequency: 8.2867 28.0355 50.7541 78.2602 96.5339 150.2834 178.9566 196.7036 214.5512 234.2467 271.5241 281.8874 301.2727 321.6151 369.3480 388.8956 402.7959 447.7405 473.6543 482.6516 483.7642 513.2824 547.8566 565.2768 606.9514 617.4371 631.4313 699.3122 703.6733 712.2458 768.5606 782.9617 818.1369 834.4324 849.2240 863.7591 894.8718 906.6750 917.2287 962.0940 973.2509 975.2370 986.5354 991.0374 992.1308 1005.9448 1027.2234 1056.1874 1058.2119 1078.8424 1085.4720 1101.0717 1125.7855 1143.7804 1172.5467 1172.7574 1198.5806 1215.8356 1229.3147 1258.8064 1277.3530 1292.1659 1314.2183 1323.3030 1335.8044 1339.3283 1343.0885 1352.3585 1368.8217 1377.0382 1390.1992 1432.9099 1456.6845 1457.8391 1464.7289 1474.3655 1478.2009 1484.2239 1488.8679 1585.5368 1588.8395 1612.0096 1678.4544 2971.9051 2976.9419 2984.7154 2984.9645 2990.8922 3025.4465 3035.8092 3036.9840 3043.7925 3053.9913 3078.3753 3086.4718 3117.7227 3124.4417 3138.5311 3154.2883 3166.3789 3558.8868 3717.9948
redmass: 6.3372 4.5399 4.5771 3.4533 4.1276 3.3379 2.8452 2.5951 1.7577 2.6574 3.0312 3.3065 2.7466 2.6518 1.9944 3.4017 2.8207 3.2730 2.1744 2.8683 1.2133 1.0589 3.2048 3.4647 5.3035 6.1328 3.1872 7.3052 1.7864 3.2860 2.0003 1.8567 2.9860 2.3774 1.2720 2.2630 1.6710 1.8194 1.7216 2.1695 1.9891 1.6882 2.7418 3.0704 1.6423 1.8927 2.3806 1.9319 1.9900 1.7934 1.7267 1.4107 1.7724 2.1772 1.0537 1.7550 1.2083 2.2358 1.9829 1.4061 1.3469 1.5684 1.3835 1.4628 1.9885 1.4783 1.4296 1.5899 1.4434 4.9928 1.2207 2.2510 1.0911 1.0831 1.0842 1.0847 1.1281 1.2221 1.5323 1.2259 5.8682 6.0188 6.9563 1.0594 1.0605 1.0584 1.0411 1.0624 1.0967 1.0950 1.0925 1.0996 1.1028 1.0993 1.0989 1.0844 1.0877 1.0934 1.0961 1.0976 1.0444 1.1057
irintensity: 1.7242 0.0455 6.0570 3.2161 2.3164 2.2664 0.2230 6.5453 3.1858 2.5419 0.4338 2.1660 0.5296 1.5759 1.0534 1.4838 0.0593 1.5430 5.7916 10.5404 283.7135 12.1775 18.6665 3.7681 0.3797 0.1611 1.6557 45.5776 39.2584 1.9433 35.7857 5.5460 1.2300 2.1428 0.2118 15.1164 10.3785 0.6195 3.1961 76.6113 25.9104 3.1478 43.1722 1.2551 28.9722 48.0787 19.9214 2.0795 14.4228 7.7394 11.4491 5.1627 14.5860 6.9441 0.0483 14.8365 0.7209 5.0864 2.6536 7.1378 60.2310 153.6826 0.6743 15.3511 151.7437 17.1112 1.8962 40.0065 2.4443 0.7789 13.4156 8.3285 17.2838 8.0532 9.4809 5.2058 1.1816 1.3771 35.6526 97.8123 1.7760 11.2884 299.6786 28.8066 31.9909 39.6253 19.7667 29.8431 53.6007 46.0064 5.8465 24.0644 75.6670 22.8114 45.9941 4.3461 2.8002 32.4452 37.9422 12.9153 54.4192 45.5060
temp: 298.150 k
press: 1.00000 atm
elementType: 8 8 7 6 6 6 6 6 6 6 6 6 6 6 6 6 6 1 1 1 1 1 1 1 1 1 1 1 1 1 1 1 1 1 1 1
symmnumber: 1
zpe: 799527.7 jmol-1
zpe.correction: 0.304524 hartree
zpe.thermalcorrener: 0.320748 hartree
zpe.thermalcorrenthalpy: 0.321692 hartree
zpe.thermalcorrgfe: 0.259135 hartree
zpe.sumelectzpe: -748.830745 hartree
zpe.sumelectthermal: -748.814522 hartree
zpe.sumelectthermalent: -748.813578 hartree
zpe.sumelectthermalfe: -748.876134 hartree
dipole: 0.1852 -0.8091 -2.3750
dipole: 2.5159
quadrupole: -97.6948 -99.8929 -96.8918
quadrupole: -5.0773 1.1776 -8.4668
quadrupole: 0.4650 -1.7331 1.2680 -5.0773 1.1776 -8.4668
hfenergy: -749.1352695 hartree
pointgroup: C01 [X(C14H19N1O2)]
dipole: 0.0061461 -0.2913497 0.9459596 debye
polarizability: 165.7262303|22.725385|156.3065974|10.8372999|-7.9765131|142.1839635 unknown
InChI: InChI=1S/C14H19NO2/c1-14(11-7-3-2-4-8-11)10-6-5-9-12(14)17-13(15)16/h2-4,7-8,12H,5-6,9-10,15H2,1H3
charge 0 multiplicity 1
36 atoms
O  -1.33242 0.809614 0.433876
O  -1.606801 2.537204 -1.157362
N  -1.499068 2.957376 1.148762
C  -0.062617 -1.160325 -0.302526
C  -1.239976 -0.200006 -0.669327
C  -0.468389 -2.003001 0.945827
C  -2.611225 -0.891037 -0.792985
C  -1.833095 -2.718252 0.797853
C  -2.963328 -1.71851 0.46222
C  1.228802 -0.337108 -0.058751
C  0.212224 -2.099331 -1.519486
C  2.057455 -0.54439 1.073346
C  1.650729 0.626795 -1.015589
C  3.261668 0.177641 1.244771
C  2.848921 1.352585 -0.848426
C  -1.488842 2.148007 0.032961
C  3.665914 1.130395 0.284555
H  -1.02373 0.355565 -1.599748
H  -0.51984 -1.328675 1.823387
H  0.31777 -2.755131 1.153332
H  -2.596516 -1.545621 -1.686622
H  -3.375428 -0.114784 -0.984242
H  -2.065132 -3.25039 1.740883
H  -1.776415 -3.495382 0.009207
H  -3.919697 -2.253219 0.306165
H  -3.109534 -1.030527 1.317693
H  0.456823 -1.516001 -2.425613
H  1.078164 -2.748806 -1.29829
H  -0.649936 -2.747102 -1.753877
H  1.770417 -1.27272 1.836997
H  1.036668 0.82819 -1.901277
H  3.882007 -0.006176 2.129942
H  3.142572 2.092953 -1.601384
H  4.598158 1.691384 0.415349
H  -1.340071 2.561151 2.071654
H  -1.591929 3.960635 1.021023
