program: Gaussian 09
title: 000230720
version: EM64L-G09RevD.01
frameworkgroup: C1[X(C11H15NO3)]
method: RPBEPBE
basis: SDD
operation: Freq
keyword: #p
keyword: freq=noraman
keyword: PBEPBE/SDD
title: #p freq=noraman PBEPBE/SDD
converged: NO YES NO NO
title: Mulliken charges:
elementType: O O O N C C C C C C C C C C C H H H H H H H H H H H H H H H
charge: -0.266151 -0.316580 -0.277061 -0.457725 0.480254 0.341839 -0.458258 -0.335844 -0.330052 -0.367749 -0.243218 0.255244 -0.685072 -0.212777 -0.674485 0.219716 0.300977 0.244786 0.249433 0.326210 0.205224 0.205423 0.228018 0.227642 0.205750 0.232535 0.232497 0.212176 0.228606 0.228644
chargesum: 0.00000
title: Mulliken charges with hydrogens summed into heavy atoms:
elementType: O O O N C C C C C C C C C C C
charge: -0.266151 -0.316580 -0.277061 -0.131515 0.480254 0.341839 -0.238542 -0.034867 -0.085267 -0.118316 0.167430 0.255244 -0.014291 0.242882 -0.005058
polarizability: 2.42532915e+02 -3.47594263e+00 1.28182031e+02 4.94804019e-02 7.46470096e-02 7.52399718e+01
1716.lowfreq: -11.2215 -7.4507 -3.8201 -0.0011 -0.0009 0.0002 27.9808 39.5451 64.8418
frequency: 27.7598 39.3164 64.8391 68.9609 71.4179 112.0899 118.5556 137.0370 188.2949 192.5551 246.6660 248.0430 257.9910 325.9078 357.9363 370.4305 384.6365 414.4515 437.0337 521.0119 578.0731 625.5418 636.1200 695.1237 708.4401 718.4350 741.9315 795.7886 800.4912 812.9678 828.1322 848.9774 871.8518 902.7988 916.8775 976.7220 980.5038 1000.5156 1037.8132 1045.8310 1111.4086 1116.0648 1125.6211 1135.1762 1140.0217 1160.3870 1182.3098 1217.8853 1249.3072 1258.4139 1266.4835 1308.1473 1353.6174 1361.2800 1380.0518 1399.3027 1400.9252 1426.4287 1461.0831 1463.4678 1476.5148 1476.7368 1487.2297 1489.2752 1499.5792 1517.9635 1592.6261 1633.6735 1662.0634 2947.6789 2996.3740 2997.2928 3004.6602 3008.5182 3066.1458 3092.7867 3094.1671 3107.4669 3107.9139 3118.5476 3160.6541 3166.4521 3189.0062 3543.7566
redmass: 3.7753 2.5335 4.5607 3.2809 4.0027 1.8354 3.6352 3.8219 5.0975 4.9711 1.1701 1.2224 4.1802 6.3098 3.9260 6.0030 3.7964 3.0594 4.2896 2.3766 5.9134 7.0252 1.2786 6.0054 6.9670 3.6513 4.3652 1.3537 1.0946 4.4795 1.1110 1.4849 4.1542 3.2731 1.3835 4.5430 1.3070 2.6253 2.8803 3.4410 2.2191 2.1294 1.3237 1.4351 1.4645 3.1579 1.3183 2.3225 1.1301 1.1457 2.4671 1.3526 1.5960 1.3751 2.9239 1.2916 1.2856 3.9533 1.0402 1.0404 1.0621 1.0800 1.1716 1.1066 1.7693 2.4769 5.5836 6.4014 8.7155 1.0551 1.0359 1.0363 1.1074 1.0581 1.1069 1.0984 1.0988 1.1013 1.1025 1.0895 1.0900 1.0936 1.0957 1.0759
irintensity: 0.5451 0.4052 2.0575 0.6801 0.8551 1.9565 8.5605 0.0067 0.3241 7.0527 1.1731 0.4273 5.2463 10.9636 3.3938 3.3328 0.7881 0.0006 1.9893 30.9575 14.2798 1.8315 45.5438 42.8380 24.5314 0.2328 7.9779 51.2394 5.7096 1.2577 0.0641 65.2007 1.7702 55.3559 2.3948 112.0402 1.4133 0.5951 156.9975 179.6224 17.3298 4.4957 34.7448 4.4155 4.8335 584.2512 11.1209 202.0329 0.0443 0.0469 30.2756 9.1823 37.6098 9.7626 97.0414 70.7074 12.1523 12.2829 11.7666 11.8614 51.9971 14.2355 27.5528 39.2833 5.7656 648.3530 49.4050 0.3380 285.4757 45.5728 25.6932 27.4318 41.2937 27.1039 10.2683 32.8899 29.9638 32.3581 49.7868 22.3836 4.7816 13.1484 4.9571 28.3454
temp: 298.150 k
press: 1.00000 atm
elementType: 8 8 8 7 6 6 6 6 6 6 6 6 6 6 6 1 1 1 1 1 1 1 1 1 1 1 1 1 1 1
symmnumber: 1
zpe: 640375.0 jmol-1
zpe.correction: 0.243906 hartree
zpe.thermalcorrener: 0.259652 hartree
zpe.thermalcorrenthalpy: 0.260597 hartree
zpe.thermalcorrgfe: 0.199251 hartree
zpe.sumelectzpe: -707.465464 hartree
zpe.sumelectthermal: -707.449717 hartree
zpe.sumelectthermalent: -707.448773 hartree
zpe.sumelectthermalfe: -707.510119 hartree
dipole: 0.2498 -3.5940 0.0102
dipole: 3.6026
quadrupole: -63.2884 -87.0942 -91.9343
quadrupole: -3.1917 -0.0143 0.0360
quadrupole: 17.4839 -6.3219 -11.1620 -3.1917 -0.0143 0.0360
hfenergy: -707.7093698 hartree
pointgroup: C01 [X(C11H15N1O3)]
dipole: 0.1061371 1.4130669 0.0310955 debye
polarizability: 242.4684189|2.9387403|128.1085413|-4.01522|1.4135462|75.3779577 unknown
InChI: InChI=1S/C11H15NO3/c1-3-14-10-7-5-9(6-8-10)12-11(13)15-4-2/h5-8,12H,3-4H2,1-2H3
charge 0 multiplicity 1
30 atoms
O  3.910636 -0.565511 -0.221674
O  -3.887921 0.472078 -0.002584
O  -2.668441 -1.545576 -0.082785
N  -1.63313 0.591168 -0.04721
C  -0.243976 0.278997 -0.089781
C  2.552226 -0.207028 -0.17497
C  0.676433 1.355415 -0.081742
C  0.247469 -1.054544 -0.14004
C  2.067607 1.123292 -0.123691
C  1.633019 -1.28489 -0.182002
C  4.906891 0.521949 -0.218826
C  -2.699296 -0.28901 -0.046743
C  6.282473 -0.13678 -0.282944
C  -5.146147 -0.32498 0.001991
C  -6.298707 0.673768 0.039825
H  0.308825 2.388703 -0.042586
H  -0.456871 -1.888922 -0.145786
H  2.74877 1.978541 -0.115757
H  2.02565 -2.305535 -0.221335
H  -1.89226 1.57943 -0.014401
H  4.736584 1.182544 -1.094581
H  4.79327 1.125784 0.705713
H  -5.165608 -0.956435 -0.904842
H  -5.136974 -0.991335 0.883644
H  7.074562 0.634181 -0.283221
H  6.437471 -0.798146 0.586178
H  6.381283 -0.741237 -1.200364
H  -7.261915 0.131658 0.043707
H  -6.249308 1.299735 0.947081
H  -6.276514 1.33549 -0.842777
