program: Gaussian 09
title: 000230713
version: EM64L-G09RevD.01
frameworkgroup: C1[X(C6H12N4O)]
method: RPBEPBE
basis: SDD
operation: Freq
keyword: #p
keyword: freq=noraman
keyword: PBEPBE/SDD
title: #p freq=noraman PBEPBE/SDD
converged: YES YES NO NO
title: Mulliken charges:
elementType: O N N N N C C C C C C H H H H H H H H H H H H
charge: -0.267280 0.011727 -0.387998 -0.610247 -0.503379 -0.198695 -0.469700 -0.522476 -0.519438 0.088440 0.206001 0.216067 0.249294 0.225951 0.240606 0.251605 0.217245 0.228266 0.318544 0.298414 0.316881 0.304534 0.305638
chargesum: 0.00000
title: Mulliken charges with hydrogens summed into heavy atoms:
elementType: O N N N N C C C C C C
charge: -0.267280 0.011727 -0.069454 0.005048 0.106793 0.017371 0.005546 -0.030265 -0.073927 0.088440 0.206001
polarizability: 1.42261371e+02 -8.62196193e-01 8.01114562e+01 -1.74808793e+00 -1.89932348e-01 7.17371899e+01
1716.lowfreq: -16.0258 -5.5129 -4.5724 -0.0010 -0.0010 -0.0009 26.4496 53.5877 105.9290
frequency: 26.4225 53.5263 105.9166 122.7837 126.7346 187.6144 204.8396 221.2656 254.5047 282.5992 303.5230 335.2919 385.5127 499.6596 531.0391 561.0904 564.9709 616.9642 718.5939 743.6265 775.6320 788.7401 833.8225 874.6231 930.6436 975.7757 991.0941 998.2881 1051.8578 1089.9120 1104.0616 1134.6645 1167.7989 1184.3017 1218.4768 1235.0572 1246.1539 1265.6024 1275.9742 1286.4085 1297.8077 1303.5474 1355.7350 1438.0141 1454.6376 1456.3909 1477.2341 1616.5075 1617.0815 1653.3646 1679.9231 2946.5282 2971.8496 2981.2177 2992.8050 3014.1779 3072.3935 3080.6068 3390.4572 3468.9376 3504.5315 3548.6561 3692.4322
redmass: 4.9205 3.9071 3.9831 2.0343 1.3513 1.3051 2.3520 3.3600 4.4034 3.8151 3.1424 3.8445 1.4783 3.9501 2.2421 1.4829 1.4933 3.3412 3.9229 3.2566 1.8860 2.6165 2.1276 3.0602 1.4079 3.3828 1.5264 2.3918 4.3042 2.8259 2.0683 1.6206 1.8596 1.5894 1.4802 1.7721 1.5936 1.5363 1.2736 1.1829 1.7863 1.6355 1.6244 1.7365 1.0869 1.0836 1.0919 3.3656 2.6867 2.0893 1.0634 1.0603 1.0785 1.0710 1.0972 1.0627 1.0976 1.1047 1.0428 1.0478 1.0985 1.0794 1.0982
irintensity: 1.9240 0.8371 6.5728 8.1014 14.4004 272.6622 41.5208 3.2235 21.5839 13.9812 5.5130 24.5246 23.3962 10.2109 0.5276 76.5084 60.6137 29.5567 0.6406 3.1979 78.1950 72.4225 4.9272 0.4558 3.2797 2.4633 5.7706 20.9079 8.5027 67.0753 19.5645 39.8994 14.0865 2.5827 6.9391 16.3865 8.6572 19.1122 1.2244 0.8130 0.7670 24.3125 22.5947 188.7123 16.3104 2.6096 8.9497 107.3734 104.0948 1.2980 27.7512 25.7393 13.6071 26.4364 19.7343 33.1616 17.6642 32.2263 0.2168 9.0664 1.6144 31.5296 43.0663
temp: 298.150 k
press: 1.00000 atm
elementType: 8 7 7 7 7 6 6 6 6 6 6 1 1 1 1 1 1 1 1 1 1 1 1
symmnumber: 1
zpe: 498186.1 jmol-1
zpe.correction: 0.189749 hartree
zpe.thermalcorrener: 0.201984 hartree
zpe.thermalcorrenthalpy: 0.202928 hartree
zpe.thermalcorrgfe: 0.150639 hartree
zpe.sumelectzpe: -529.152164 hartree
zpe.sumelectthermal: -529.139929 hartree
zpe.sumelectthermalent: -529.138985 hartree
zpe.sumelectthermalfe: -529.191274 hartree
dipole: 1.3751 1.6565 -2.3751
dipole: 3.2056
quadrupole: -55.4467 -65.0750 -69.9256
quadrupole: 5.9103 1.3348 -1.4454
quadrupole: 8.0358 -1.5925 -6.4432 5.9103 1.3348 -1.4454
hfenergy: -529.3419131 hartree
pointgroup: C01 [X(C6H12N4O1)]
dipole: -0.5443534 1.114447 -0.2285656 debye
dipolederiv: -0.7015753 0.1575623 0.062133 -0.0258627 -0.7476449 -0.2904663 -0.0792503 -0.2428625 -0.5592488 0.8238013 -0.0674064 -0.0522728 -0.4435213 -0.1888025 0.1783505 0.4656781 0.1172889 -0.3321131 -0.4476279 -0.2998931 -0.1971518 -0.4559985 -0.38253 -0.0352936 -0.3126408 -0.005918 -0.4972971 -1.0816122 -0.028221 0.1179976 0.478386 -0.5683692 -0.3904616 -0.4685627 -0.3158757 -0.1516763 -0.3212818 -0.0927392 -0.1223788 -0.1857306 -0.2207193 -0.1755356 -0.2027368 -0.1585828 -0.1793007 -0.4068631 0.0412937 -0.0254688 0.0730291 0.0974332 0.0391319 -0.0686027 0.0441772 0.049578 0.1158322 0.0438141 -0.0258852 0.0178131 0.1264537 0.0069117 0.1243138 -0.0656949 0.0805914 -0.0099517 -0.0104506 -0.0139724 0.2275505 0.0532823 0.030331 -0.0545527 0.0886816 0.0672203 -0.0550652 0.0065411 0.0142587 -0.0277364 0.1322661 0.1874845 -0.0278824 0.2088439 -0.038667 0.0284997 0.0074251 -0.0019825 -0.1819994 0.0424955 -0.2183846 0.1579296 -0.2311459 0.2155449 1.2746608 0.0951925 0.2404722 0.2019607 0.8175062 0.5260511 0.3643756 0.4933562 0.5669573 0.029306 -0.0152077 -0.0124206 -0.0174292 -0.1203864 -0.098533 -0.0162411 -0.0987021 -0.0296901 0.0542706 0.0262397 0.0337735 0.0216749 -0.0117528 -0.1148765 0.0175737 -0.0531782 0.0194479 0.002245 -0.0708253 0.0400036 -0.0833311 -0.0866161 0.1254296 0.0266834 0.0865439 0.0095414 0.029848 -0.0096302 -0.0048525 -0.0232896 0.0841964 0.0156384 -0.0419126 0.0361409 -0.129832 -0.0064868 0.0583639 0.0108865 0.0414814 -0.0566889 -0.0282146 -0.0217012 -0.0768118 0.0710005 -0.0715738 -0.0281281 -0.1223474 -0.0504116 0.0492045 -0.0619924 -0.0476605 -0.0176153 -0.0863201 0.0221681 0.0745649 0.0112711 0.0437185 -0.1255209 0.0165149 0.0632546 -0.0414002 0.0390436 0.0999371 0.0775036 0.005934 0.1131376 0.1955146 -0.0796253 0.0245594 -0.0867478 0.2731321 0.0919299 0.0166079 0.0072976 0.0163223 0.2956292 0.158932 -0.0566498 0.1664007 0.069989 0.1818089 0.0036561 -0.0019407 -0.0074208 0.3306126 0.112773 -0.0662627 0.1071848 0.2424967 0.1922623 0.0520476 -0.0179705 0.1820409 0.2443475 -0.0071279 0.0890145 0.0239686 0.0307731 0.1554678 -0.0383108 0.054616 0.0856161 0.0400889 0.1029629 0.1312736 0.0219485 0.268829 unknown
polarizability: 142.3086446|-0.5198058|73.2670618|0.4753141|-3.2859682|78.5343108 unknown
InChI: InChI=1S/C6H12N4O/c7-9-5-2-1-4(3-5)6(11)10-8/h4,10H,1-3,7-8H2
charge 0 multiplicity 1
23 atoms
O  2.297155 -1.017645 -0.652101
N  -2.891811 -0.344751 0.848865
N  2.947437 0.736409 0.722098
N  -4.090641 0.098088 0.325658
N  4.32148 0.374815 0.754526
C  0.561257 0.550367 0.119837
C  -0.07074 0.810469 -1.283895
C  -0.421163 -0.47989 0.753868
C  -1.60277 0.817542 -1.031419
C  -1.777742 -0.036835 0.2276
C  1.98817 0.014191 0.018295
H  0.539725 1.487971 0.712656
H  0.209611 -0.030805 -1.943513
H  0.294645 1.743796 -1.746424
H  -0.387782 -0.509026 1.855773
H  -0.156428 -1.48903 0.377877
H  -2.16443 0.420532 -1.902075
H  -1.979832 1.847296 -0.850323
H  2.696709 1.560875 1.269835
H  -4.1715 0.565622 -0.580793
H  -4.922085 -0.217616 0.811347
H  4.719695 0.406402 -0.195257
H  4.430439 -0.570681 1.149565
