program: Gaussian 09
title: 000230704
version: EM64L-G09RevD.01
frameworkgroup: C1[X(C15H15NO5S)]
method: RPBEPBE
basis: SDD
operation: Freq
keyword: #p
keyword: freq=noraman
keyword: PBEPBE/SDD
title: #p freq=noraman PBEPBE/SDD
converged: YES YES NO NO
title: Mulliken charges:
elementType: S O O O O O N C C C C C C C C C C C C C C C H H H H H H H H H H H H H H H
charge: 0.844086 -0.539148 -0.520991 -0.266914 -0.199571 -0.200681 0.021253 -0.211687 -0.212017 0.541422 0.403699 -0.455785 -0.210289 0.461194 -0.540632 0.412163 -0.322866 -0.387937 -0.823844 -0.349075 -0.802686 -0.529070 0.306932 0.308449 0.297081 0.250512 0.295848 0.232371 0.291331 0.252208 0.237135 0.235721 0.238715 0.230043 0.233907 0.225745 0.253381
chargesum: 0.00000
title: Mulliken charges with hydrogens summed into heavy atoms:
elementType: S O O O O O N C C C C C C C C C C C C C C C
charge: 0.844086 -0.539148 -0.520991 -0.266914 -0.199571 -0.200681 0.021253 -0.211687 -0.212017 0.541422 0.403699 -0.148854 0.098159 0.461194 -0.243551 0.412163 -0.072354 -0.092089 -0.047934 -0.111940 -0.098207 0.183964
polarizability: 2.92146712e+02 3.01388558e+01 1.95931501e+02 9.31729215e+00 1.57506930e+01 1.70455297e+02
1716.lowfreq: -29.4800 -6.5651 -4.0632 -0.0016 -0.0014 0.0009 9.4461 21.6440 27.3448
frequency: -29.3639 21.3184 27.2585 33.8051 58.2711 78.0095 89.6985 105.2954 129.9975 137.7190 145.5812 166.7691 183.4748 191.5363 205.8737 214.6094 220.9026 226.4145 267.0707 283.1744 305.2842 338.5053 339.9850 376.0041 380.4776 421.7564 436.5513 447.2868 463.9746 492.5542 522.2747 528.0594 545.2385 547.7717 566.6078 657.6017 665.6414 685.2880 707.9304 724.7121 735.2370 746.5433 785.6193 815.4781 841.2742 864.3759 890.7087 914.6229 920.7875 928.8285 962.3148 980.1970 992.5735 998.3863 999.0182 1006.5726 1023.5885 1050.5793 1056.0604 1089.8499 1112.3290 1133.3116 1141.2146 1163.3944 1205.2586 1211.9188 1218.4121 1244.6414 1258.8208 1266.9477 1358.4667 1366.3393 1375.5184 1401.3917 1407.7507 1409.3159 1423.1055 1434.4087 1453.2842 1461.6172 1467.5644 1468.7720 1471.7433 1474.0525 1481.3928 1489.7885 1566.0322 1573.4190 1613.9448 1622.5664 2972.2114 2981.5154 2988.8051 3059.9358 3066.7421 3071.4209 3092.9071 3107.4379 3129.6029 3131.6383 3137.7028 3149.2407 3164.9378 3173.1697 3190.1491
redmass: 1.0323 4.6418 5.7265 5.5429 7.5143 3.8387 4.7261 4.2588 1.5996 4.4340 2.9510 4.8923 4.3334 4.5917 4.1766 1.1826 8.7255 4.2770 5.5411 5.4272 6.0048 3.5638 4.1682 8.2651 5.8273 5.9693 5.5582 3.9854 3.7806 5.9272 4.9939 4.7485 5.0574 5.0127 3.7754 7.3807 7.6591 5.2877 5.0614 3.6568 3.8032 9.9227 14.9336 1.4385 6.1228 1.3713 5.0409 8.6430 1.4042 1.4146 1.3437 7.1828 1.5300 4.9843 1.4663 1.5061 2.6421 1.5312 1.5515 1.8181 1.2541 1.3973 1.4012 1.3216 3.5510 1.7648 6.0645 6.0831 1.3867 1.5182 4.0324 5.0048 7.0518 1.2266 4.3490 1.2455 4.6143 1.1944 3.0532 1.0449 1.0740 1.0676 1.0460 1.1075 1.1209 2.5722 6.0329 5.8420 8.3808 7.1628 1.0325 1.0378 1.0385 1.0977 1.1048 1.0952 1.0988 1.1005 1.0895 1.0914 1.1003 1.0909 1.0942 1.0920 1.0949
irintensity: 0.2024 0.1945 1.4449 0.2335 0.5128 4.6963 3.9057 0.1048 3.0687 1.1080 4.8444 1.4905 0.8612 6.0376 2.0165 0.2016 2.1826 0.9371 1.4303 1.1487 0.7129 6.4269 4.4219 26.9544 6.7213 39.0056 0.2943 2.9774 35.7413 89.1287 2.1935 11.0453 6.1666 27.1607 8.2517 1.0035 15.9075 17.8806 5.9644 6.0975 6.4308 41.7569 77.3886 46.4289 12.1326 17.0938 5.8326 68.8014 3.0866 14.8124 1.6223 33.1876 4.9743 0.4433 2.8010 2.5170 18.6130 12.9042 14.5173 31.4024 0.0678 10.5152 17.9949 10.6046 123.0969 3.6214 173.9486 102.6162 30.0967 25.4159 17.0906 24.1330 96.6943 10.2917 5.5200 16.1354 7.6659 7.2166 40.3964 23.7829 42.2126 24.5836 14.1346 19.2387 28.8963 116.9382 2.9225 20.0756 6.3857 15.1495 53.6010 33.5329 10.1562 16.6691 32.5392 11.6508 13.7152 10.0975 9.2483 15.8423 8.6174 10.7964 10.9148 1.8543 1.8812
temp: 298.150 k
press: 1.00000 atm
elementType: 16 8 8 8 8 8 7 6 6 6 6 6 6 6 6 6 6 6 6 6 6 6 1 1 1 1 1 1 1 1 1 1 1 1 1 1 1
symmnumber: 1
zpe: 713195.9 jmol-1
zpe.correction: 0.271642 hartree
zpe.thermalcorrener: 0.293040 hartree
zpe.thermalcorrenthalpy: 0.293984 hartree
zpe.thermalcorrgfe: 0.219938 hartree
zpe.sumelectzpe: -1407.665588 hartree
zpe.sumelectthermal: -1407.644190 hartree
zpe.sumelectthermalent: -1407.643246 hartree
zpe.sumelectthermalfe: -1407.717292 hartree
dipole: -5.6299 3.2858 -4.9625
dipole: 8.1926
quadrupole: -150.4679 -122.5875 -148.9113
quadrupole: -4.7715 21.1711 3.6212
quadrupole: -9.8123 18.0681 -8.2558 -4.7715 21.1711 3.6212
hfenergy: -1407.9372297 hartree
pointgroup: C01 [X(C15H15N1O5S1)]
dipole: -2.2713722 -0.5179858 2.2274944 debye
polarizability: 285.4141683|-39.4173031|208.9151503|-0.4923183|7.1631054|164.2041913 unknown
InChI: InChI=1S/C15H15NO5S/c1-10-4-6-13(21-3)15(8-10)22(19,20)14-7-5-12(16(17)18)9-11(14)2/h4-9H,1-3H3
charge 0 multiplicity 1
37 atoms
S  -0.820626 0.297791 -1.730913
O  -1.018852 1.818169 -2.313851
O  -0.909642 -0.966105 -2.759199
O  -1.130735 -1.980654 0.277624
O  5.44355 -1.359932 0.411496
O  5.221722 0.626971 1.507841
N  4.779685 -0.298434 0.724188
C  0.897077 0.180388 -0.885739
C  -2.101103 0.120611 -0.338992
C  1.371758 1.206917 -0.033124
C  -2.134382 -1.035836 0.473538
C  -3.041695 1.154443 -0.234539
C  1.626728 -0.964324 -1.240466
C  -4.082972 1.067094 0.72326
C  2.675871 1.015562 0.488412
C  3.417465 -0.135036 0.147842
C  -3.172446 -1.125204 1.435642
C  2.922212 -1.134114 -0.716558
C  0.573872 2.443774 0.32669
C  -4.123218 -0.088212 1.545628
C  -5.127212 2.161738 0.849305
C  -1.194843 -3.225946 1.053027
H  -2.949941 2.013359 -0.910568
H  1.170626 -1.693873 -1.918373
H  3.121213 1.757015 1.15772
H  -3.241964 -1.994943 2.095578
H  3.538626 -2.003208 -0.957406
H  1.177318 3.133489 0.938237
H  0.230945 2.965535 -0.583283
H  -0.333363 2.180872 0.902419
H  -4.919507 -0.181878 2.294013
H  -4.880653 3.028979 0.214425
H  -6.126106 1.797958 0.542925
H  -5.215496 2.519025 1.89182
H  -2.137792 -3.767679 0.851766
H  -1.093009 -3.025974 2.136555
H  -0.340314 -3.821238 0.702064
