program: Gaussian 09
title: 000230693
version: EM64L-G09RevD.01
frameworkgroup: C1[X(C14H12ClNO3S)]
method: RPBEPBE
basis: SDD
operation: Freq
keyword: #p
keyword: freq=noraman
keyword: PBEPBE/SDD
title: #p freq=noraman PBEPBE/SDD
converged: YES YES NO NO
title: Mulliken charges:
elementType: Cl S O O O N C C C C C C C C C C C C C C H H H H H H H H H H H H
charge: -0.039376 0.379365 -0.250264 -0.211436 -0.194526 0.004521 -0.416229 0.455423 0.407188 -0.355877 -0.397644 -0.415159 -0.344603 0.472611 -0.058714 -0.805330 -0.329284 -0.266021 -0.076677 -0.535345 0.263025 0.233692 0.245977 0.266190 0.237732 0.231034 0.224398 0.311265 0.262806 0.220385 0.226975 0.253897
chargesum: 0.00000
title: Mulliken charges with hydrogens summed into heavy atoms:
elementType: Cl S O O O N C C C C C C C C C C C C C C
charge: -0.039376 0.379365 -0.250264 -0.211436 -0.194526 0.004521 -0.416229 0.455423 0.407188 -0.092852 -0.397644 -0.181467 -0.098626 0.472611 0.207476 -0.112166 -0.018019 -0.003215 -0.076677 0.165912
polarizability: 3.04612683e+02 8.44937335e+00 1.94027723e+02 1.89895462e+01 -2.88208289e+00 1.48585208e+02
1716.lowfreq: -8.2416 0.0016 0.0018 0.0020 0.6342 5.7964 16.2685 24.0409 31.4667
frequency: 16.0940 23.9886 31.1430 48.3179 79.2758 88.8199 93.1864 133.4683 150.5300 154.7504 167.0963 196.4334 202.3182 233.4087 240.9304 293.4688 315.0738 329.6248 339.4401 357.1548 373.8560 408.9233 431.4679 444.1086 456.7365 502.2641 517.7294 544.3854 571.0102 581.5728 654.7744 661.3111 670.2686 706.6142 708.1767 724.7777 731.8503 811.8215 825.6159 828.8184 856.0800 897.0079 917.1147 946.6002 967.7601 980.8892 999.3406 1020.9662 1042.0224 1048.9782 1081.0387 1101.8290 1111.3129 1142.5414 1154.4838 1165.8790 1199.9694 1216.0970 1238.1796 1243.6309 1271.3762 1343.0446 1360.8199 1361.8546 1394.6640 1402.8700 1403.9109 1434.8244 1442.2897 1468.5266 1469.4715 1470.5747 1476.8535 1485.0293 1554.2027 1570.3140 1589.8017 1612.5948 2965.4376 2978.5924 3056.4548 3057.4717 3085.7515 3128.9667 3133.3901 3136.0867 3156.2059 3162.7694 3175.5333 3186.9916
redmass: 5.6418 5.0592 1.0873 5.9107 7.8046 7.0582 3.3575 4.2917 7.4878 5.9238 7.9148 6.0494 5.7642 1.7665 1.7542 7.3776 9.7445 6.2752 4.1379 4.4800 9.2296 7.7933 3.6249 5.1261 4.3644 5.1507 4.6453 4.2483 5.4183 5.0469 8.0702 5.6616 7.1522 5.2270 8.8365 6.1819 3.6646 1.4498 1.3686 9.1389 5.8437 1.3405 1.4124 1.3540 1.3445 5.7224 1.5536 6.5835 3.1050 1.5538 1.6473 8.5497 1.2586 1.3974 1.4244 1.3094 9.5727 1.8030 3.8020 1.5507 1.5175 4.4260 6.2674 4.4551 3.9859 1.2456 7.3547 1.2191 2.3962 1.1893 1.0586 1.0487 1.0993 2.0729 8.7575 6.0658 7.0342 6.6077 1.0328 1.0376 1.1042 1.0974 1.0989 1.0894 1.0995 1.0920 1.0880 1.0943 1.0968 1.0927
irintensity: 0.2378 0.5018 0.2575 1.0109 0.8443 0.1806 2.6201 3.1086 3.4046 1.3065 0.5865 1.0573 1.9495 0.3719 0.4432 0.0570 2.8462 3.1618 2.4878 0.2660 1.9361 10.2719 3.7506 2.8638 8.9337 12.8881 16.6784 2.7074 31.6579 3.4383 4.1301 0.6583 0.9160 15.9423 19.8980 4.0743 3.1912 50.0329 21.3223 23.9500 2.2913 5.7448 21.6022 0.9264 0.3372 42.8804 2.4588 64.3292 15.4708 13.5690 17.6558 23.0402 0.0884 20.2355 3.9041 8.1723 323.1862 9.7658 113.0087 19.7113 11.2624 52.6303 96.6300 10.7479 1.8585 10.4393 1.4212 8.2948 211.7139 88.6784 17.4999 15.4267 18.3954 62.2518 11.0423 8.7446 0.2165 10.6658 63.1225 40.9790 34.9805 21.1908 18.4852 20.2983 9.4364 4.1650 0.8236 14.9409 2.1985 10.3962
temp: 298.150 k
press: 1.00000 atm
elementType: 17 16 8 8 8 7 6 6 6 6 6 6 6 6 6 6 6 6 6 6 1 1 1 1 1 1 1 1 1 1 1 1
symmnumber: 1
zpe: 600040.9 jmol-1
zpe.correction: 0.228544 hartree
zpe.thermalcorrener: 0.247990 hartree
zpe.thermalcorrenthalpy: 0.248934 hartree
zpe.thermalcorrgfe: 0.177707 hartree
zpe.sumelectzpe: -1677.696189 hartree
zpe.sumelectthermal: -1677.676743 hartree
zpe.sumelectthermalent: -1677.675799 hartree
zpe.sumelectthermalfe: -1677.747026 hartree
dipole: -6.1678 -5.4894 0.6597
dipole: 8.2832
quadrupole: -126.9869 -143.2043 -116.5124
quadrupole: -1.2379 -1.5598 -5.9919
quadrupole: 1.9143 -14.3031 12.3888 -1.2379 -1.5598 -5.9919
hfenergy: -1677.924733 hartree
pointgroup: C01 [X(C14H12Cl1N1O3S1)]
dipole: -2.3991139 -1.2335581 1.8282915 debye
polarizability: 307.0523518|3.4351591|169.6837396|-5.956031|-24.0714107|170.4895232 unknown
InChI: InChI=1S/C14H12ClNO3S/c1-9-3-5-12(19-2)14(7-9)20-13-6-4-10(15)8-11(13)16(17)18/h3-8H,1-2H3
charge 0 multiplicity 1
32 atoms
Cl 4.493523 -2.804785 0.860812
S  -0.270885 1.121628 -1.17023
O  -0.90615 1.301036 1.780214
O  4.123042 1.663636 -1.902089
O  1.924103 2.155562 -2.267028
N  2.861723 1.427432 -1.743241
C  -1.7251 0.396703 -0.281784
C  -3.928922 -0.70632 -0.451452
C  -1.937637 0.645597 1.105147
C  -2.711583 -0.266719 -1.037608
C  1.083648 0.02192 -0.610792
C  -4.119382 -0.455627 0.927745
C  -3.143881 0.20972 1.705527
C  2.452892 0.271646 -0.928364
C  0.810256 -1.133498 0.1709
C  -4.985092 -1.405518 -1.288932
C  3.498167 -0.57707 -0.482214
C  1.830316 -1.990255 0.615008
C  3.172727 -1.697424 0.283586
C  -1.114819 1.635426 3.193063
H  -2.52611 -0.439316 -2.104192
H  -5.048269 -0.782596 1.410085
H  -3.332106 0.386483 2.7687
H  -0.226749 -1.366153 0.427712
H  -5.443546 -0.711376 -2.018774
H  -4.555356 -2.245168 -1.865475
H  -5.796361 -1.80953 -0.659277
H  4.526012 -0.325784 -0.754399
H  1.586974 -2.875661 1.209386
H  -1.231812 0.723193 3.80944
H  -1.997271 2.291019 3.321247
H  -0.204153 2.172799 3.493579
