program: Gaussian 09
title: 000230692
version: EM64L-G09RevD.01
frameworkgroup: C1[X(C14H12ClNO3S)]
method: RPBEPBE
basis: SDD
operation: Freq
keyword: #p
keyword: freq=noraman
keyword: PBEPBE/SDD
title: #p freq=noraman PBEPBE/SDD
converged: YES YES NO NO
title: Mulliken charges:
elementType: Cl S O O O N C C C C C C C C C C C C C C H H H H H H H H H H H H
charge: -0.015941 0.361778 -0.281023 -0.223772 -0.167343 0.006041 -0.360572 0.462890 0.448141 -0.381212 -0.301556 -0.426162 -0.332578 0.474589 -0.807961 -0.044602 -0.364823 -0.232496 -0.199099 -0.543481 0.259371 0.231289 0.243393 0.232813 0.231891 0.223076 0.278161 0.265988 0.246377 0.217609 0.226359 0.272854
chargesum: 0.00000
title: Mulliken charges with hydrogens summed into heavy atoms:
elementType: Cl S O O O N C C C C C C C C C C C C C C
charge: -0.015941 0.361778 -0.281023 -0.223772 -0.167343 0.006041 -0.360572 0.462890 0.448141 -0.121841 -0.301556 -0.194873 -0.089185 0.474589 -0.120180 -0.044602 -0.086662 0.033492 0.047279 0.173341
polarizability: 2.65179376e+02 -2.09861936e+01 1.86381875e+02 -1.74681990e+01 2.79426488e+00 1.53448932e+02
1716.lowfreq: -0.0029 -0.0026 -0.0020 3.8737 5.2959 7.2456 25.9574 39.6888 43.7925
frequency: 25.9033 39.6818 43.7824 54.3102 73.3294 87.6535 92.1088 132.8929 142.8792 169.4266 175.7294 188.8180 204.9375 233.3633 239.9840 254.1551 314.7509 332.2873 335.0615 349.8556 388.6849 404.6432 437.2661 444.9489 450.3382 471.0703 517.1708 546.3466 575.0245 579.2502 667.1913 671.3372 687.5400 708.7311 712.5291 720.9764 732.8881 802.9384 807.2412 817.4423 854.5973 892.3142 913.3763 941.2501 978.1764 982.0076 998.1785 1017.2729 1040.7837 1049.0100 1083.3735 1113.9781 1125.2455 1144.1782 1156.3160 1168.4564 1192.5999 1213.3673 1223.7327 1239.7618 1269.2557 1359.9329 1364.4010 1371.7524 1396.7440 1400.4759 1408.3848 1418.2798 1433.9867 1467.3574 1470.4524 1475.0704 1476.9461 1483.3021 1562.4683 1570.7463 1580.1068 1612.5447 2964.9618 2976.7553 3054.6155 3057.9941 3084.1284 3127.0753 3128.9904 3139.9816 3155.6454 3162.6298 3173.6899 3185.8429
redmass: 5.1757 6.1782 1.0847 5.9103 8.0371 3.9063 7.7684 4.2937 7.1957 7.6242 4.7767 5.7700 4.5383 6.3577 1.1212 5.9778 11.1225 7.0138 3.5101 4.3745 7.9910 7.6313 5.4146 4.6376 6.2914 5.9892 3.8201 4.1149 3.8970 6.3615 9.0074 7.1788 8.7303 5.0090 6.9472 3.1252 2.9222 1.7982 1.4494 9.4235 5.8031 1.3566 1.3931 1.3561 1.3527 5.2816 1.5976 6.4225 3.1697 1.5311 3.0825 1.2527 2.2972 1.3955 1.5937 1.3207 1.4440 1.7552 8.4145 6.0883 1.5304 9.1939 4.4022 7.5170 3.7279 1.2732 2.7269 2.6320 1.2203 1.1441 1.0453 1.0611 1.0998 2.2518 6.8887 6.1568 6.9129 6.6805 1.0319 1.0372 1.0979 1.1044 1.0986 1.0995 1.0904 1.0920 1.0875 1.0942 1.0930 1.0995
irintensity: 0.0518 2.2355 0.4902 1.2207 1.7398 3.4752 2.2735 1.9719 0.2649 0.3313 0.0659 1.3864 1.1510 2.6797 0.0854 3.0973 3.4169 1.2622 1.6684 0.5464 2.1313 3.7899 4.1217 4.7089 2.5322 4.5914 7.8305 3.5178 2.5535 4.7782 14.9972 1.7861 8.9673 15.6421 17.1892 13.9826 12.1418 42.5467 46.7042 10.4624 4.6876 3.5735 1.8407 0.5479 1.6499 38.5684 1.5640 13.3151 11.1524 10.1976 13.8098 0.0207 18.7461 21.8777 2.7903 1.0939 10.8275 4.1260 141.1713 153.8334 6.3677 15.4300 6.2239 84.6818 6.4937 7.9469 24.3006 44.8469 8.6817 71.2766 13.6395 14.1838 19.4836 63.9947 1.9830 6.9369 3.0897 6.9059 58.8167 44.6234 18.5228 38.2490 19.2281 11.0832 10.1297 3.9315 4.1918 12.6613 1.1609 5.1841
temp: 298.150 k
press: 1.00000 atm
elementType: 17 16 8 8 8 7 6 6 6 6 6 6 6 6 6 6 6 6 6 6 1 1 1 1 1 1 1 1 1 1 1 1
symmnumber: 1
zpe: 599909.1 jmol-1
zpe.correction: 0.228493 hartree
zpe.thermalcorrener: 0.247910 hartree
zpe.thermalcorrenthalpy: 0.248854 hartree
zpe.thermalcorrgfe: 0.179126 hartree
zpe.sumelectzpe: -1677.687658 hartree
zpe.sumelectthermal: -1677.668241 hartree
zpe.sumelectthermalent: -1677.667297 hartree
zpe.sumelectthermalfe: -1677.737025 hartree
dipole: -1.6247 1.3156 -4.8173
dipole: 5.2514
quadrupole: -115.9515 -125.7855 -129.5044
quadrupole: 10.9119 -9.6968 5.8112
quadrupole: 7.7957 -2.0384 -5.7573 10.9119 -9.6968 5.8112
hfenergy: -1677.9161512 hartree
pointgroup: C01 [X(C14H12Cl1N1O3S1)]
dipole: 0.6996265 -0.7302793 -1.801613 debye
polarizability: 261.3015324|-21.9865461|187.2080358|24.513852|-7.9106135|156.5006139 unknown
InChI: InChI=1S/C14H12ClNO3S/c1-9-6-7-12(19-2)13(8-9)20-14-10(15)4-3-5-11(14)16(17)18/h3-8H,1-2H3
charge 0 multiplicity 1
32 atoms
Cl 0.345816 -3.191916 0.307436
S  -0.023806 -0.218494 1.747642
O  0.126256 1.614528 -0.599691
O  -3.051675 2.150803 -0.161393
O  -2.493232 1.38123 1.917145
N  -2.643487 1.226472 0.650325
C  1.448209 0.073811 0.671918
C  3.855526 -0.249945 0.257362
C  1.376766 1.032102 -0.380031
C  2.669452 -0.553697 0.977638
C  -1.214024 -0.852908 0.488541
C  3.766326 0.695563 -0.791288
C  2.54627 1.332241 -1.116538
C  -2.347486 -0.102146 0.068616
C  5.167324 -0.931293 0.606493
C  -1.043892 -2.111575 -0.140865
C  -3.242325 -0.553443 -0.924048
C  -1.932781 -2.60163 -1.120181
C  -3.036611 -1.815143 -1.512632
C  0.01528 2.675548 -1.606965
H  2.693408 -1.294419 1.784721
H  4.664528 0.94384 -1.369135
H  2.516978 2.062107 -1.931279
H  5.480122 -0.69931 1.642062
H  5.083771 -2.031631 0.530808
H  5.979293 -0.609507 -0.068046
H  -4.077209 0.088789 -1.216443
H  -1.759944 -3.587464 -1.560706
H  -3.73075 -2.190122 -2.270586
H  0.252466 2.292251 -2.618116
H  0.678805 3.525901 -1.359909
H  -1.037673 2.989654 -1.558854
