program: Gaussian 09
title: 000230689
version: EM64L-G09RevD.01
frameworkgroup: C1[X(C13H10N2O4S)]
method: RPBEPBE
basis: SDD
operation: Freq
keyword: #p
keyword: freq=noraman
keyword: PBEPBE/SDD
title: #p freq=noraman PBEPBE/SDD
converged: YES YES NO NO
title: Mulliken charges:
elementType: S O O O O N N C C C C C C C C C C C C C H H H H H H H H H H
charge: 0.401284 -0.184505 -0.202978 -0.171478 -0.179998 0.005286 -0.000904 -0.578594 0.523191 0.568118 0.489206 -0.506369 -0.592051 -0.794755 -0.234839 -0.201950 -0.228913 -0.208105 -0.206635 -0.223754 0.285295 0.296047 0.236821 0.241157 0.244047 0.255489 0.265731 0.233871 0.235962 0.234323
chargesum: 0.00000
title: Mulliken charges with hydrogens summed into heavy atoms:
elementType: S O O O O N N C C C C C C C C C C C C C
charge: 0.401284 -0.184505 -0.202978 -0.171478 -0.179998 0.005286 -0.000904 -0.578594 0.523191 0.568118 0.489206 -0.221074 -0.296005 -0.072730 -0.234839 0.053539 0.036818 0.025766 0.029328 0.010569
polarizability: 2.87949521e+02 6.33244667e+00 1.83033212e+02 -1.84262641e+01 1.72710247e+01 1.34353540e+02
1716.lowfreq: -7.7474 -1.9529 -0.4890 -0.0009 0.0003 0.0012 10.5770 30.5963 40.8285
frequency: 6.8264 30.5880 40.8174 43.5354 59.0399 79.9164 95.8037 141.0173 168.5057 173.7803 178.0835 204.7761 226.3478 260.3508 304.8297 318.2208 341.2185 381.1273 400.1561 409.7958 413.5211 441.0091 467.0270 493.6824 549.4462 608.9252 621.9958 624.9874 661.7085 670.5603 680.1040 694.5748 714.3208 726.0280 741.7864 756.9513 848.4232 863.8407 906.5395 927.4265 938.6781 949.9087 977.1554 985.7244 998.8496 1010.2658 1012.8799 1030.9302 1054.7417 1068.3768 1076.4749 1128.3268 1174.4566 1185.4893 1190.7787 1199.3936 1210.1175 1244.0872 1306.0936 1354.3040 1358.1007 1375.3612 1378.9915 1403.7242 1407.1565 1427.9276 1445.0392 1459.9764 1469.3203 1470.6516 1551.2773 1586.4400 1588.5518 1612.1046 2986.9658 3066.9420 3099.5097 3132.6588 3141.1984 3152.7234 3160.6165 3163.7014 3169.8515 3175.2689
redmass: 1.0477 6.2208 6.4118 4.8195 7.8492 8.5411 12.1097 4.7984 8.1985 7.0810 8.9322 4.5049 4.3192 6.3668 6.2100 9.4468 6.7181 9.2819 3.0510 5.2197 8.4085 7.0168 6.9052 4.0348 3.8523 6.4393 5.7050 5.8978 7.3968 6.6870 10.2794 2.2516 8.1848 12.4867 3.5457 1.7093 1.2485 9.8248 1.4842 1.3711 6.6970 1.3976 1.5085 4.6015 1.3371 1.4876 3.6114 5.6193 1.5727 2.3489 1.6066 2.0664 1.0534 1.1676 3.4076 2.9508 7.3082 3.3011 1.3142 4.9202 4.7625 9.5041 10.2723 1.2504 5.1828 2.1110 4.3981 2.0792 1.0696 1.1055 5.6756 5.9352 6.3160 6.6337 1.0379 1.0976 1.0992 1.0853 1.0887 1.0934 1.0921 1.0968 1.0924 1.1008
irintensity: 0.8430 0.7836 2.1091 1.0867 1.4089 0.4862 1.1612 0.0793 1.1155 2.2574 0.9116 1.7370 1.7595 1.5813 0.3121 0.9995 0.8904 2.2132 0.4757 0.0133 0.9432 11.8383 0.7629 13.9988 16.7722 0.1634 1.7509 2.3980 5.9084 6.2299 21.2009 40.6819 0.3054 5.8760 29.0338 45.0428 0.9321 24.1197 18.3710 2.3237 0.2959 2.2032 1.6400 10.9200 0.2999 6.0518 14.7552 15.4293 15.0764 1.2828 9.1184 11.6000 0.1224 12.1281 149.0517 143.7350 147.9592 4.3433 1.8938 63.8918 35.9969 47.9973 31.0264 14.8521 6.3873 7.2217 150.8583 17.1600 13.3073 9.0685 36.3425 6.3542 1.7504 0.7045 20.7133 11.7488 11.0560 0.3580 2.8554 16.9090 1.7001 16.8990 2.5642 16.7636
temp: 298.150 k
press: 1.00000 atm
elementType: 16 8 8 8 8 7 7 6 6 6 6 6 6 6 6 6 6 6 6 6 1 1 1 1 1 1 1 1 1 1
symmnumber: 1
zpe: 545250.0 jmol-1
zpe.correction: 0.207675 hartree
zpe.thermalcorrener: 0.225909 hartree
zpe.thermalcorrenthalpy: 0.226854 hartree
zpe.thermalcorrgfe: 0.157665 hartree
zpe.sumelectzpe: -1308.242672 hartree
zpe.sumelectthermal: -1308.224437 hartree
zpe.sumelectthermalent: -1308.223493 hartree
zpe.sumelectthermalfe: -1308.292681 hartree
dipole: -0.3336 4.1840 2.2829
dipole: 4.7779
quadrupole: -106.5861 -133.9921 -120.7211
quadrupole: -20.8554 3.1343 4.4497
quadrupole: 13.8470 -13.5590 -0.2880 -20.8554 3.1343 4.4497
hfenergy: -1308.4503464 hartree
pointgroup: C01 [X(C13H10N2O4S1)]
dipole: 0.6239203 0.8819928 -1.5382995 debye
polarizability: 267.6525186|-49.9060617|179.9736498|-10.2590676|-29.41257|157.7101049 unknown
InChI: InChI=1S/C13H10N2O4S/c1-9-7-11(14(16)17)13(12(8-9)15(18)19)20-10-5-3-2-4-6-10/h2-8H,1H3
charge 0 multiplicity 1
30 atoms
S  -0.974648 -1.108717 1.266374
O  -0.153726 2.620234 -0.926715
O  2.497687 -3.729634 0.800177
O  -0.653996 2.006529 1.210048
O  0.812658 -2.958556 2.138653
N  -0.052936 1.82864 0.087451
N  1.683136 -2.804829 1.193535
C  0.639339 -0.586184 0.573151
C  3.145525 0.047224 -0.784525
C  0.891483 0.680655 -0.033575
C  1.749322 -1.484495 0.533742
C  2.085888 0.982214 -0.714919
C  2.960672 -1.186057 -0.130444
C  4.434018 0.381739 -1.507855
C  -2.166998 -0.293534 0.098803
C  -2.136643 -0.595526 -1.281968
C  -3.188777 0.51359 0.646047
C  -3.135374 -0.06345 -2.128246
C  -4.194505 1.024835 -0.205852
C  -4.166668 0.742427 -1.591096
H  2.180164 1.971666 -1.173897
H  3.742732 -1.950904 -0.125279
H  5.121947 -0.479391 -1.526727
H  4.236931 0.683008 -2.55271
H  4.959361 1.223519 -1.01958
H  -1.353619 -1.244079 -1.689663
H  -3.186189 0.752658 1.713544
H  -3.113529 -0.289628 -3.199683
H  -4.986577 1.655049 0.212052
H  -4.942977 1.148399 -2.24864
