program: Gaussian 09
title: 000230679
version: EM64L-G09RevD.01
frameworkgroup: C1[X(C10H10N4O2)]
method: RPBEPBE
basis: SDD
operation: Freq
keyword: #p
keyword: freq=noraman
keyword: PBEPBE/SDD
title: #p freq=noraman PBEPBE/SDD
converged: YES YES NO NO
title: Mulliken charges:
elementType: O O N N N N C C C C C C C C C C H H H H H H H H H H
charge: -0.258466 -0.220353 -0.069473 -0.141614 -0.605343 -0.017193 0.038745 0.245368 -0.267604 -0.328209 -0.231917 -0.202314 -0.271406 0.214126 -0.492206 -0.095611 0.257732 0.262525 0.235126 0.237788 0.296272 0.245975 0.247725 0.225813 0.354930 0.339585
chargesum: 0.00000
title: Mulliken charges with hydrogens summed into heavy atoms:
elementType: O O N N N N C C C C C C C C C C
charge: -0.258466 -0.220353 -0.069473 -0.141614 0.089172 -0.017193 0.038745 0.245368 -0.009872 -0.065684 0.003209 0.035474 0.024865 0.214126 0.227307 -0.095611
polarizability: 2.36808439e+02 -9.20849078e+00 1.64643165e+02 -7.69875812e+00 -4.29430395e+00 7.18567120e+01
1716.lowfreq: -6.4931 -4.1628 -0.0007 -0.0001 0.0004 4.6810 20.0197 45.3827 54.9734
frequency: 19.9050 45.3800 54.9546 76.8818 86.3892 130.4881 139.7650 179.2346 185.2036 236.4647 249.9835 271.7295 289.6252 327.2684 359.0052 404.5431 438.1600 473.7856 489.4222 498.2012 531.0143 553.4335 586.7308 606.8525 659.2318 679.2786 699.4224 731.7202 770.8302 780.9230 838.0251 856.7699 870.6295 927.6856 963.7570 968.4086 988.6537 1014.8863 1031.7551 1082.6463 1100.1877 1101.4836 1150.1638 1163.9235 1183.4741 1200.0960 1228.0438 1242.1565 1273.2028 1319.4812 1399.5032 1399.8223 1420.6796 1439.3826 1444.4350 1451.8995 1469.1568 1551.4519 1564.2495 1609.2409 1671.4763 2203.6723 2978.5223 3014.3776 3129.0012 3139.6686 3141.9758 3152.1486 3167.9133 3179.4331 3457.7736 3646.0180
redmass: 6.9068 5.8989 4.1290 4.9589 6.0554 7.6760 5.9723 4.9809 2.9363 5.4410 1.4227 5.7890 3.7016 5.0023 7.7428 6.4131 5.3972 4.0083 3.8998 3.2322 3.6812 6.7029 6.2372 2.0301 2.6451 4.4412 1.1334 3.8968 1.5912 3.1831 6.9211 7.1987 1.5292 6.3538 7.2087 1.3877 1.3241 3.4661 2.0183 1.9790 1.3804 1.7516 1.3225 1.1309 1.2775 2.7064 2.4765 1.4138 1.9624 3.4080 6.7732 6.4586 1.6659 1.6545 1.1871 1.0601 1.9354 1.2447 6.7732 6.0993 8.4772 12.5700 1.0805 1.0282 1.1044 1.0857 1.1067 1.0895 1.0957 1.0994 1.0481 1.1012
irintensity: 1.5676 7.4840 2.3594 3.0078 2.1263 2.0764 3.3667 1.8530 2.7564 1.7900 0.4222 7.3169 12.0198 5.3120 18.5304 7.4555 1.6824 3.8118 14.4575 8.8877 1.6441 9.5016 23.1872 81.3118 140.8478 23.7923 59.5978 4.8008 75.4663 27.3371 0.8411 2.2802 1.4519 2.8418 30.7711 3.0774 0.1646 16.3273 8.3750 20.5479 3.2324 11.4383 11.8595 34.6460 7.2746 43.3608 112.6285 32.9938 71.2551 159.1960 67.2966 34.1219 46.1016 17.6275 2.3414 16.5400 90.5835 190.3685 33.0637 43.9093 317.8663 2.2129 2.1012 27.9251 22.3754 3.3574 32.2121 4.9217 13.0949 17.3911 53.8697 97.6165
temp: 298.150 k
press: 1.00000 atm
elementType: 8 8 7 7 7 7 6 6 6 6 6 6 6 6 6 6 1 1 1 1 1 1 1 1 1 1
symmnumber: 1
zpe: 500595.7 jmol-1
zpe.correction: 0.190667 hartree
zpe.thermalcorrener: 0.206070 hartree
zpe.thermalcorrenthalpy: 0.207014 hartree
zpe.thermalcorrgfe: 0.146397 hartree
zpe.sumelectzpe: -755.291956 hartree
zpe.sumelectthermal: -755.276553 hartree
zpe.sumelectthermalent: -755.275609 hartree
zpe.sumelectthermalfe: -755.336226 hartree
dipole: 4.6198 -4.8271 0.2833
dipole: 6.6875
quadrupole: -105.8191 -86.1121 -91.0778
quadrupole: 9.0370 -2.3767 1.9270
quadrupole: -11.4827 8.2242 3.2585 9.0370 -2.3767 1.9270
hfenergy: -755.4826232 hartree
pointgroup: C01 [X(C10H10N4O2)]
dipole: -1.9507857 1.330567 -1.1604415 debye
dipolederiv: -0.381322 0.2426359 -0.2720971 0.0613236 -0.8044297 0.6308969 -0.0438347 0.5592506 -0.9564404 -1.2029299 0.2287942 0.0010288 0.3577358 -0.4326202 -0.0146871 0.1969276 -0.0275008 -0.5800512 1.0391376 -0.00811 -0.1256021 -0.0521052 -0.0237184 0.0828569 -0.0251038 -0.0109749 -0.1035019 -0.2686308 -0.041761 -0.0273301 -0.2828223 -0.2376486 0.0092931 0.7100053 0.0107675 -0.3893987 -0.6080613 -0.0643897 -0.1740704 -0.0396922 -0.6045159 0.098724 -0.1430674 0.2038597 -0.9809172 -0.2015944 -0.0122803 -0.0007872 0.0630379 -0.1990828 0.0251627 -0.094177 -0.0121631 -0.2330209 -0.8260339 -0.0927194 0.2634433 0.2718215 -0.0922565 0.0158278 -0.3955004 0.0642002 -0.0482516 0.2562881 -0.2191614 0.2401595 0.0773618 0.6590996 -0.6483325 -0.172762 -0.5460139 0.8492355 0.2269626 0.0463997 -0.0881746 -0.2476985 -0.0444812 0.0037343 0.3383367 -0.0566749 -0.1040309 0.0554172 0.289773 -0.3772082 0.0522987 -0.252352 0.0767383 -0.0647023 0.0468847 -0.2401044 -0.6058608 -0.0736725 0.1839557 -0.0728733 -0.0601858 -0.1148104 0.1300998 -0.1253572 -0.0760873 0.2607379 -0.0036238 -0.0386564 0.2135995 0.0346367 -0.2223343 -0.2706447 -0.1645981 0.1314596 -0.0049886 0.0945018 0.2312702 0.0551845 0.2592394 -0.1278173 0.3099029 -0.0526011 -0.0320317 1.4144125 -0.3793192 0.0640371 -0.5093469 0.3580918 0.0459256 -0.2981013 -0.0437858 1.3724044 0.4128701 -0.2409643 0.2681035 -0.0637739 0.4149442 -0.1802226 0.0472432 -0.1657878 0.4580307 -0.1609741 0.0269954 0.0019941 0.0215622 -0.0163229 -0.0646189 0.0401105 -0.022584 0.0270823 0.0659549 -0.0749781 0.0733374 -0.0393243 0.1096431 0.0499809 0.0276818 0.0622366 0.076102 0.0319587 -0.027187 0.0475865 -0.0554927 0.1071904 0.0801428 0.0743677 0.07428 0.0796859 0.0452359 0.0433451 -0.0309901 0.0529764 0.0381494 0.1306486 -0.0554469 0.1294606 0.0331341 -0.1072858 0.0454986 -0.0205255 0.0504221 0.1209721 0.0322524 -0.0295731 0.0349524 0.12157 -0.0081489 -0.0150455 -0.0081411 0.0235313 0.0228166 0.0184488 -0.142008 0.0134995 0.0991874 0.005496 0.0194433 -0.1208315 -0.0941542 -0.0659482 -0.0421448 -0.0315543 -0.0166102 0.0671043 0.024534 0.1056 -0.0425065 0.0381129 0.0508325 -0.0354358 0.0888684 -0.0659403 -0.0812875 0.0457149 -0.0355693 0.0472291 -0.0155291 -0.0047308 0.1463948 0.0221546 0.1450286 -0.0445919 0.3042148 0.0636776 -0.1007639 0.0453152 0.3182764 0.0170558 -0.2108115 -0.0194013 0.3491163 0.1868954 0.0821168 0.0055397 0.0885291 0.3444008 -0.0136801 -0.0084109 -0.0144272 0.2056031 unknown
polarizability: 233.5186135|-23.5905881|104.4062409|-14.557001|-41.090632|135.3834608 unknown
InChI: InChI=1S/C10H10N4O2/c1-16-9-5-3-2-4-7(9)13-14-8(6-11)10(12)15/h2-5,8H,12H2,1H3
charge 0 multiplicity 1
26 atoms
O  -2.11794 -1.488631 1.737726
O  4.215314 -1.052664 -1.691042
N  0.049134 -0.235667 0.126177
N  0.90117 0.265175 -0.721394
N  2.360057 -0.251598 -2.870988
N  2.643791 -1.865713 1.546511
C  -1.319674 0.072878 -0.102222
C  -2.306315 -0.567008 0.727991
C  -1.753144 1.007586 -1.097773
C  -3.684437 -0.259055 0.517729
C  -3.106108 1.299947 -1.283865
C  -4.079276 0.653348 -0.466824
C  2.326051 -0.08636 -0.416529
C  3.070154 -0.534592 -1.7322
C  -0.797626 -1.985163 2.182565
C  2.520184 -1.073772 0.664769
H  -0.981116 1.500094 -1.697441
H  -4.413125 -0.763638 1.158528
H  -3.418815 2.024029 -2.042784
H  -5.143515 0.874082 -0.602193
H  2.82915 0.85791 -0.118521
H  -0.173673 -1.163271 2.565393
H  -0.260285 -2.476656 1.356841
H  -1.043825 -2.703084 2.979147
H  1.426105 0.157874 -2.774312
H  2.759664 -0.480055 -3.780389
