program: Gaussian 09
title: 000230674
version: EM64L-G09RevD.01
frameworkgroup: C1[X(C16H24N2O3)]
method: RPBEPBE
basis: SDD
operation: Freq
keyword: #p
keyword: freq=noraman
keyword: PBEPBE/SDD
title: #p freq=noraman PBEPBE/SDD
converged: YES YES NO NO
title: Mulliken charges:
elementType: O O O N N C C C C C C C C C C C C C C C C H H H H H H H H H H H H H H H H H H H H H H H H
charge: -0.289654 -0.492666 -0.278130 -0.349756 -0.376053 -0.066388 -0.169615 -0.079180 -0.426355 -0.427438 -0.399798 -0.541668 0.165753 -0.208479 -0.678978 0.425711 -0.406781 -0.359453 -0.199926 -0.204173 -0.269589 0.274536 0.254796 0.182948 0.211238 0.206083 0.210095 0.210569 0.217216 0.201839 0.235993 0.231225 0.347832 0.193219 0.185707 0.359924 0.229995 0.229785 0.204451 0.314826 0.225445 0.240474 0.220948 0.218984 0.224486
chargesum: 0.00000
title: Mulliken charges with hydrogens summed into heavy atoms:
elementType: O O O N N C C C C C C C C C C C C C C C C
charge: -0.289654 -0.144834 -0.278130 0.010168 -0.061227 0.208148 0.085181 0.103768 -0.009034 -0.006774 0.019257 -0.074450 0.165753 0.170447 -0.014746 0.425711 -0.181336 -0.118978 0.021022 0.014811 -0.045103
polarizability: 2.64829134e+02 1.12180431e+01 1.79445489e+02 -2.39815153e+01 1.41623229e+01 1.60047650e+02
1716.lowfreq: -2.0039 -0.0006 -0.0006 -0.0004 4.7130 12.1480 23.9801 26.1758 38.2103
frequency: 16.4095 26.0832 37.3129 44.6303 58.6231 61.1219 76.4690 93.4906 128.5786 151.5267 169.9391 195.6530 203.6871 230.1766 247.0193 252.5808 263.2467 286.3093 294.3345 331.5115 339.4292 366.5549 383.4344 406.8857 440.5129 463.2653 478.8003 484.8960 525.2191 533.5118 591.7472 610.6180 620.6484 634.2685 665.3313 692.4394 713.3691 753.9370 760.2493 785.7618 807.6178 814.8733 821.5718 836.3324 851.8963 858.5950 881.9306 892.1293 913.5428 944.0041 958.6781 967.3558 974.3487 977.7159 981.2199 982.9748 1022.0399 1036.9834 1051.4965 1064.8893 1081.8737 1083.1600 1089.9798 1105.5633 1116.0435 1128.1579 1137.8472 1153.5392 1169.4271 1183.6559 1185.6281 1188.9418 1218.1174 1249.8122 1254.2606 1268.2169 1278.2286 1286.1060 1294.6746 1308.3878 1320.2251 1321.9515 1325.6429 1334.1647 1347.9986 1353.3512 1361.3396 1376.6637 1384.4660 1394.0517 1396.9846 1432.8355 1452.9534 1458.0083 1459.5140 1464.9856 1467.9630 1470.7508 1478.8650 1486.2379 1492.6565 1527.9384 1589.3395 1611.1650 1624.6398 2871.8967 2926.0021 2974.5379 2979.6112 2985.1900 2985.8267 2990.0801 2995.2242 3003.5803 3012.5412 3036.4911 3038.4324 3053.5048 3082.9694 3092.8970 3102.6172 3118.8403 3126.5419 3140.5604 3155.3400 3167.7116 3333.9338 3447.5671 3553.9557
redmass: 4.9531 4.1167 2.6626 2.1729 3.9019 5.3660 5.2363 4.6355 4.4205 3.1553 4.1686 4.6497 3.7866 1.7232 2.6533 2.8837 2.8123 3.1514 3.1955 3.3945 2.9914 1.7563 1.5046 2.9138 3.8554 2.4914 3.5654 2.1982 2.8349 2.9208 3.8655 4.8219 3.3165 4.2429 2.5375 1.9651 3.6105 1.7734 2.6385 1.5523 2.1651 1.1396 1.4169 2.9150 2.4946 1.8123 1.4937 2.3979 2.1904 2.6957 1.3684 2.7355 2.8202 1.3622 4.3516 2.7130 2.1789 2.1489 3.1871 1.7372 1.8574 1.7096 2.1096 2.1000 1.8988 1.6151 1.4872 1.9294 1.0489 1.1564 1.4211 1.5414 1.3905 1.1671 1.2133 1.3432 1.8070 1.2288 2.0631 1.4436 1.3781 1.4164 1.4158 1.4600 1.4338 1.5784 1.4837 1.3391 4.6163 1.5880 1.2929 2.0908 1.0969 1.1158 1.0434 1.1063 1.4047 1.2125 1.0498 2.4210 1.0787 1.6709 5.9608 4.5964 5.8076 1.0826 1.0570 1.0612 1.0968 1.0665 1.0833 1.0659 1.0361 1.0792 1.0651 1.1002 1.0982 1.1034 1.1015 1.0991 1.1010 1.0857 1.0869 1.0934 1.0942 1.1007 1.0827 1.0750 1.0658
irintensity: 0.3118 0.0619 0.9592 0.2896 0.8720 2.2830 1.1837 3.6475 4.3791 1.4464 5.1660 1.8104 16.6839 4.9267 7.3360 4.3446 7.2342 13.9990 9.1291 3.2330 1.4989 58.6142 116.5595 0.2366 2.4958 11.8586 30.9647 61.4041 49.4336 11.1866 3.5564 3.5978 6.7273 17.1625 9.2966 37.6496 11.7482 99.7481 33.2484 210.3452 9.5985 2.2683 1.8415 10.7289 9.6476 1.4589 8.7723 3.7126 24.7231 8.0128 0.3378 6.7778 2.7019 1.9381 3.7926 39.9394 4.3934 33.0201 93.1083 0.4182 51.4359 10.6070 12.3613 12.0630 7.9977 55.5988 8.8065 12.8493 0.9349 13.7301 9.6783 15.2294 15.0283 0.5019 8.9976 13.0863 51.9222 32.2585 1.0531 1.5008 8.7734 18.8381 13.0408 2.5451 8.1030 0.8710 5.1644 0.6386 43.0603 5.1348 20.4562 52.1136 10.4052 18.8429 6.7164 3.1424 100.1184 34.3930 8.8556 191.8506 4.4909 20.8990 68.3105 196.9712 120.1056 74.7328 64.2804 29.9865 47.5289 24.2685 55.6347 19.9937 23.6676 4.3819 29.3515 25.8692 50.7347 54.8054 15.3114 35.0295 33.9130 10.3372 2.1284 29.3463 37.5037 14.5935 219.1923 68.3862 4.5420
temp: 298.150 k
press: 1.00000 atm
elementType: 8 8 8 7 7 6 6 6 6 6 6 6 6 6 6 6 6 6 6 6 6 1 1 1 1 1 1 1 1 1 1 1 1 1 1 1 1 1 1 1 1 1 1 1 1
symmnumber: 1
zpe: 998594.4 jmol-1
zpe.correction: 0.380345 hartree
zpe.thermalcorrener: 0.401604 hartree
zpe.thermalcorrenthalpy: 0.402548 hartree
zpe.thermalcorrgfe: 0.327904 hartree
zpe.sumelectzpe: -957.633590 hartree
zpe.sumelectthermal: -957.612330 hartree
zpe.sumelectthermalent: -957.611386 hartree
zpe.sumelectthermalfe: -957.686031 hartree
dipole: -4.5837 0.3874 -4.5623
dipole: 6.4788
quadrupole: -115.9846 -119.3041 -133.2151
quadrupole: -0.7617 1.1493 0.3201
quadrupole: 6.8500 3.5305 -10.3805 -0.7617 1.1493 0.3201
hfenergy: -958.0139342 hartree
pointgroup: C01 [X(C16H24N2O3)]
dipole: 1.8914776 0.4988879 -1.634182 debye
polarizability: 262.146858|0.1075133|186.5434733|31.480984|-3.9108991|155.6319419 unknown
InChI: InChI=1S/C16H24N2O3/c1-2-21-14-10-6-7-12(16(14)20)11-15(19)18-17-13-8-4-3-5-9-13/h3-5,8-9,12,14,16-18,20H,2,6-7,10-11H2,1H3
charge 0 multiplicity 1
45 atoms
O  3.679628 -1.173095 -0.201552
O  0.99072 1.310772 -0.816341
O  -0.782368 -0.903783 2.640127
N  -1.236862 0.225216 0.658488
N  -2.151369 -0.779222 0.26669
C  1.947111 0.715242 1.365413
C  1.786315 0.267651 -0.1041
C  3.145395 0.054817 -0.815614
C  2.929072 1.908331 1.500925
C  4.089075 1.265661 -0.660683
C  4.290774 1.624339 0.827368
C  0.587232 1.080446 2.035429
C  -0.522756 0.051448 1.838623
C  4.827401 -1.761727 -0.911077
C  5.106186 -3.120949 -0.269606
C  -3.456218 -0.411724 -0.143551
C  -4.411437 -1.444502 -0.364585
C  -3.816517 0.937747 -0.405286
C  -5.700577 -1.125634 -0.833322
C  -5.111406 1.23992 -0.881066
C  -6.062488 0.217746 -1.101294
H  2.376989 -0.161932 1.88838
H  1.235048 -0.693592 -0.146981
H  2.959405 -0.141832 -1.901633
H  2.469025 2.802518 1.034105
H  3.071798 2.138377 2.574473
H  5.056732 1.056314 -1.15494
H  3.636898 2.127049 -1.192759
H  4.79261 0.781894 1.341988
H  4.952408 2.50643 0.918051
H  0.746145 1.18316 3.122724
H  0.254746 2.059379 1.643319
H  1.023778 1.12961 -1.790287
H  5.714203 -1.098306 -0.826693
H  4.579068 -1.87049 -1.990814
H  -0.784598 0.773732 -0.093724
H  4.229582 -3.7837 -0.367494
H  5.328591 -3.000941 0.804782
H  5.972738 -3.606215 -0.754721
H  -2.056246 -1.601789 0.878075
H  -4.136741 -2.48869 -0.170938
H  -3.098451 1.740209 -0.21012
H  -6.426932 -1.931035 -0.992481
H  -5.378718 2.285819 -1.072788
H  -7.064991 0.459935 -1.469008
