program: Gaussian 09
title: 000230665
version: EM64L-G09RevD.01
frameworkgroup: C1[X(C7H19N4O2P)]
method: RPBEPBE
basis: SDD
operation: Freq
keyword: #p
keyword: freq=noraman
keyword: PBEPBE/SDD
title: #p freq=noraman PBEPBE/SDD
converged: YES YES NO NO
title: Mulliken charges:
elementType: P O O N N N N C C C C C C C H H H H H H H H H H H H H H H H H H H
charge: 1.391342 -0.591612 -0.317226 -0.482971 -0.460279 -0.807774 -0.143558 -0.589852 -0.582607 -0.591273 -0.578230 0.394120 -0.621954 -0.645595 0.359586 0.221310 0.219681 0.268066 0.223769 0.227967 0.238037 0.233834 0.224369 0.245743 0.207190 0.269062 0.246359 0.285062 0.226943 0.219532 0.239096 0.243895 0.227968
chargesum: 0.00000
title: Mulliken charges with hydrogens summed into heavy atoms:
elementType: P O O N N N N C C C C C C C
charge: 1.391342 -0.591612 -0.317226 -0.482971 -0.460279 -0.448188 -0.143558 0.119204 0.107166 0.112673 0.144382 0.394120 0.109582 0.065364
polarizability: 1.55016271e+02 1.94836456e+00 1.38471539e+02 6.32638219e-01 3.24437499e+00 1.10029157e+02
1716.lowfreq: -10.8494 0.0005 0.0007 0.0011 1.6802 6.5702 38.3643 48.4444 55.3285
frequency: 38.3463 48.3078 55.3099 75.4490 88.6937 105.1467 119.4171 129.4057 146.1265 154.3905 165.0326 179.9484 184.5498 187.5843 211.0013 215.4934 233.9425 253.9357 300.9092 312.7008 316.2680 333.3297 351.2564 401.9294 409.3757 431.5634 477.8845 499.2843 583.2504 600.3771 664.7342 711.9162 776.4379 833.5702 943.0030 953.1974 1011.3892 1036.4858 1056.0237 1059.3362 1060.3986 1088.7109 1092.1920 1096.1617 1131.0011 1132.4868 1135.9129 1159.2020 1170.5373 1194.0085 1255.2376 1257.3800 1266.0801 1306.4241 1397.1561 1416.6581 1417.2339 1418.1896 1435.7024 1439.0986 1445.8261 1456.0584 1460.5415 1468.0109 1474.8608 1478.0173 1479.8419 1484.2957 1484.3529 1489.0472 1492.4870 1496.8136 1500.8299 1601.6095 2933.5010 2941.9149 2942.4780 2944.3813 2960.6238 2965.0360 3023.1491 3027.1804 3033.7022 3037.5991 3039.1850 3045.8484 3080.7416 3082.3177 3085.7853 3100.9058 3103.5566 3117.2141 3547.8045
redmass: 3.2218 2.8227 3.4557 3.5097 2.6103 1.7207 2.3705 1.7530 1.4935 2.1064 2.1079 1.0586 1.5814 1.1322 1.9451 2.2030 2.9566 2.9599 3.2189 4.1074 3.7364 3.2854 3.9170 2.8293 3.0235 3.8302 2.3489 1.7742 5.2944 4.6509 5.7439 11.2947 5.9156 6.5328 3.0516 3.0988 2.4522 9.9953 1.4174 1.3962 1.4134 1.2194 1.2135 1.2334 1.3654 1.3614 1.3770 1.7828 4.7320 5.3490 2.0697 5.8290 2.0822 1.8240 2.3401 1.1595 1.1229 1.1384 1.1448 1.1423 1.2573 1.0468 1.0463 1.0546 1.0604 1.0590 1.0472 1.0473 1.0499 1.0733 1.0519 1.0513 1.1818 6.3168 1.0435 1.0435 1.0407 1.0387 1.0351 1.0367 1.0922 1.0951 1.0958 1.0928 1.0986 1.1019 1.0992 1.0995 1.0999 1.0988 1.0967 1.0966 1.0767
irintensity: 2.4853 0.8792 1.9318 2.0535 1.8176 7.9352 1.4904 0.9549 0.3702 1.0930 1.2366 0.2466 0.1459 0.1647 2.3297 5.0240 14.6853 3.1872 13.6285 11.2906 4.9262 14.4529 27.4730 18.9072 7.9137 1.4333 53.8460 69.9582 52.3686 21.6133 79.3143 43.4453 117.3193 15.2497 213.0838 93.0964 16.8725 92.6786 9.0598 16.1743 11.5403 0.0911 0.0565 2.6143 2.9133 8.0863 14.5591 173.7670 29.9133 46.6546 8.8096 10.8105 6.8726 61.9235 387.2958 45.4580 18.0188 31.2525 3.6596 10.8460 73.8854 5.4273 2.5026 13.4712 18.1566 18.8625 16.5305 24.3775 6.0755 16.5580 11.6807 3.2838 81.6704 294.2654 90.4197 42.6474 143.0558 36.1728 75.0398 90.3216 59.1410 19.1908 43.2584 62.9520 8.4555 34.1998 28.8640 22.7917 23.0668 6.1212 7.0278 1.2120 12.2009
temp: 298.150 k
press: 1.00000 atm
elementType: 15 8 8 7 7 7 7 6 6 6 6 6 6 6 1 1 1 1 1 1 1 1 1 1 1 1 1 1 1 1 1 1 1
symmnumber: 1
zpe: 719862.4 jmol-1
zpe.correction: 0.274181 hartree
zpe.thermalcorrener: 0.293556 hartree
zpe.thermalcorrenthalpy: 0.294500 hartree
zpe.thermalcorrgfe: 0.226711 hartree
zpe.sumelectzpe: -987.642245 hartree
zpe.sumelectthermal: -987.622870 hartree
zpe.sumelectthermalent: -987.621926 hartree
zpe.sumelectthermalfe: -987.689715 hartree
dipole: -1.4256 -3.5225 -5.2352
dipole: 6.4690
quadrupole: -78.6214 -86.2414 -102.7697
quadrupole: 5.8663 -1.8913 -1.9115
quadrupole: 10.5894 2.9695 -13.5589 5.8663 -1.8913 -1.9115
hfenergy: -987.916426 hartree
pointgroup: C01 [X(C7H19N4O2P1)]
dipole: -0.2604016 -1.1059284 -2.2774268 debye
polarizability: 154.0063929|0.9033026|137.151669|6.6384377|6.9795721|112.358904 unknown
InChI: InChI=1S/C7H19N4O2P/c1-9(2)7(12)8-14(13,10(3)4)11(5)6/h8H,1-6H3
charge 0 multiplicity 1
33 atoms
P  0.963561 -0.076726 0.546964
O  0.889034 -0.171381 2.139407
O  -1.677864 1.38612 0.386092
N  1.998613 -1.245724 -0.29522
N  1.500397 1.472504 -0.039574
N  -0.540164 -0.53064 -0.307857
N  -2.883181 -0.347053 -0.64217
C  3.417126 -0.900924 -0.533744
C  1.807509 -2.663276 0.098959
C  1.256509 1.830415 -1.450831
C  1.432331 2.602085 0.915252
C  -1.713208 0.234763 -0.155865
C  -4.11519 0.456689 -0.663414
C  -2.95123 -1.733348 -1.123341
H  -0.47237 -1.271521 -1.008332
H  3.772409 -1.440939 -1.431853
H  4.068597 -1.179523 0.323321
H  3.513243 0.182961 -0.703953
H  2.093553 -3.319602 -0.744557
H  0.752246 -2.859853 0.357044
H  2.421761 -2.937713 0.98288
H  1.388696 0.948705 -2.101588
H  1.991963 2.597754 -1.756848
H  0.234582 2.238255 -1.599547
H  2.266168 3.299589 0.710801
H  1.526785 2.214403 1.942824
H  0.464798 3.13632 0.833337
H  -3.878558 1.454274 -0.263362
H  -4.89613 -0.004925 -0.028987
H  -4.506816 0.557103 -1.694367
H  -3.99265 -2.089919 -1.0483
H  -2.327708 -2.3961 -0.496733
H  -2.637511 -1.837779 -2.183837
