program: Gaussian 09
title: 000230656
version: EM64L-G09RevD.01
frameworkgroup: C1[X(C12H10FN5)]
method: RPBEPBE
basis: SDD
operation: Freq
keyword: #p
keyword: freq=noraman
keyword: PBEPBE/SDD
title: #p freq=noraman PBEPBE/SDD
converged: YES YES NO NO
title: Mulliken charges:
elementType: F N N N N N C C C C C C C C C C C C H H H H H H H H H H
charge: -0.158099 -0.143616 -0.082141 -0.050399 -0.064914 -0.608781 -0.581599 0.164130 0.496960 -0.097474 -0.213824 0.182686 -0.358045 -0.412764 -0.229463 -0.222275 -0.025761 -0.232457 0.226302 0.262443 0.265497 0.275587 0.226284 0.232227 0.228564 0.232264 0.339896 0.348774
chargesum: 0.00000
title: Mulliken charges with hydrogens summed into heavy atoms:
elementType: F N N N N N C C C C C C C C C C C C
charge: -0.158099 -0.143616 -0.082141 -0.050399 -0.064914 0.079889 -0.092854 0.164130 0.496960 -0.097474 0.051673 0.182686 -0.082458 -0.186479 0.002764 0.006289 -0.025761 -0.000193
polarizability: 2.06615264e+02 -1.20557514e+01 1.63128704e+02 8.15701060e+00 -4.34724810e+00 1.03576076e+02
1716.lowfreq: -6.8706 0.0002 0.0002 0.0011 3.9034 10.6114 19.6617 37.9385 41.9087
frequency: 19.6098 37.9213 41.8650 108.6853 149.0385 157.6038 203.1629 232.2323 264.2584 289.4400 328.8041 372.4251 385.5262 404.4071 456.1199 473.8356 524.6742 532.7884 549.2564 571.5787 603.7698 616.7701 634.5246 642.5440 664.3846 687.1852 702.3622 717.7980 772.5341 783.1827 802.7122 810.6118 824.1626 859.9126 916.8788 929.0812 950.7061 984.7824 990.1804 1004.3251 1017.9115 1027.5032 1062.3407 1085.2463 1138.0156 1174.7828 1180.9269 1193.0499 1213.2223 1239.5669 1273.4595 1311.5334 1327.7369 1339.7919 1362.2275 1364.4812 1384.9542 1401.4313 1439.0412 1445.0277 1456.8708 1475.9301 1487.2621 1557.7134 1581.7471 1595.8538 1614.8390 1637.1948 3022.2786 3081.8671 3114.3095 3127.2954 3136.9706 3149.3381 3165.7098 3233.1278 3539.7051 3693.4612
redmass: 5.4017 4.8332 5.1684 6.1777 8.7000 4.8588 5.3429 7.3363 3.6694 4.9756 2.8779 8.1953 4.0357 2.8300 3.9989 10.1366 6.2560 1.2549 1.0821 5.5593 4.7096 6.4232 4.6289 5.5725 6.6136 11.7902 3.2983 1.7624 3.3744 5.0754 7.0595 2.1699 2.4057 1.2508 3.1708 1.7072 1.8845 1.3856 6.0593 1.3228 5.9112 2.2773 2.9296 1.6802 1.8773 1.0548 1.9488 1.1574 2.6747 3.5925 2.9281 2.1324 4.9647 1.3654 1.5348 7.0476 7.4031 8.4236 3.1652 2.3550 1.9945 2.0723 2.0691 5.8231 2.0697 6.0231 5.9256 2.6656 1.0594 1.1050 1.0881 1.0869 1.0916 1.0960 1.1015 1.0985 1.0445 1.1057
irintensity: 0.7095 1.4949 0.5646 3.7205 1.1511 4.1487 4.3241 0.0694 7.0522 2.6655 0.5711 0.5380 0.2035 0.1849 3.1625 1.0584 6.8727 259.7274 4.5717 7.4616 4.9579 0.7202 12.2390 48.5965 1.5642 9.9265 2.7056 138.0384 7.0184 19.2168 0.5866 13.5743 2.4173 0.4996 18.9788 1.6295 12.1075 0.7492 0.1686 1.4209 11.0952 8.7878 24.8541 25.6912 24.2465 0.0710 22.1892 1.1351 5.7342 53.0311 56.4715 53.1272 241.4636 16.1822 9.3863 80.1552 5.0312 48.5104 17.7902 26.1025 17.5717 48.6820 32.9059 92.2006 84.0570 1.7596 6.1006 655.3757 25.8990 3.8600 9.8552 0.2498 8.3059 25.1805 25.8078 0.0146 142.5721 54.2540
temp: 298.150 k
press: 1.00000 atm
elementType: 9 7 7 7 7 7 6 6 6 6 6 6 6 6 6 6 6 6 1 1 1 1 1 1 1 1 1 1
symmnumber: 1
zpe: 548220.8 jmol-1
zpe.correction: 0.208806 hartree
zpe.thermalcorrener: 0.222957 hartree
zpe.thermalcorrenthalpy: 0.223901 hartree
zpe.thermalcorrgfe: 0.165847 hartree
zpe.sumelectzpe: -835.641206 hartree
zpe.sumelectthermal: -835.627055 hartree
zpe.sumelectthermalent: -835.626111 hartree
zpe.sumelectthermalfe: -835.684165 hartree
dipole: 2.2946 -3.9316 -0.5612
dipole: 4.5866
quadrupole: -88.4250 -107.8918 -99.6000
quadrupole: 7.9037 5.7384 -5.3312
quadrupole: 10.2140 -9.2529 -0.9611 7.9037 5.7384 -5.3312
hfenergy: -835.8500119 hartree
pointgroup: C01 [X(C12H10F1N5)]
dipole: -0.8630069 -1.5698696 0.2168923 debye
polarizability: 205.9553806|13.1335698|163.7561828|8.1560395|4.6878193|103.6084815 unknown
InChI: InChI=1S/C12H10FN5/c13-12-16-10(14)9-11(17-12)18(7-15-9)6-8-4-2-1-3-5-8/h1-5,7H,6,14H2
charge 0 multiplicity 1
28 atoms
F  2.580816 3.00024 -0.531265
N  -0.010404 -0.999679 -0.834179
N  1.528815 -2.294376 0.281036
N  1.178575 1.181028 -0.776184
N  3.348913 1.013596 0.356498
N  4.174694 -0.992928 1.283061
C  -1.254996 -0.592528 -1.530342
C  1.047913 -0.153961 -0.506798
C  -2.36183 -0.148369 -0.579197
C  1.990765 -0.969929 0.176042
C  0.329888 -2.267064 -0.330929
C  3.186866 -0.327697 0.615577
C  -2.276801 1.112205 0.066462
C  -3.480979 -0.980696 -0.333927
C  -3.29568 1.526055 0.951671
C  -4.502535 -0.56531 0.551161
C  2.35376 1.640668 -0.303871
C  -4.410236 0.688785 1.196743
H  -1.586058 -1.445854 -2.147685
H  -0.97099 0.232982 -2.206693
H  -0.331148 -3.124138 -0.441389
H  -1.412783 1.758833 -0.128767
H  -3.558667 -1.953016 -0.837398
H  -3.223795 2.500858 1.44647
H  -5.366028 -1.214575 0.733586
H  -5.201153 1.012955 1.882271
H  5.007226 -0.485388 1.575654
H  4.067752 -1.985198 1.483794
