program: Gaussian 09
title: 000230650
version: EM64L-G09RevD.01
frameworkgroup: C1[X(C12H15NO4)]
method: RPBEPBE
basis: SDD
operation: Freq
keyword: #p
keyword: freq=noraman
keyword: PBEPBE/SDD
title: #p freq=noraman PBEPBE/SDD
converged: NO YES NO NO
title: Mulliken charges:
elementType: O O O O N C C C C C C C C C C C C H H H H H H H H H H H H H H H
charge: -0.232371 -0.448846 -0.278483 -0.278244 -0.398158 -0.216290 -0.372335 0.288342 0.181851 0.260023 -0.261646 -0.346324 -0.347694 -0.222566 -0.237185 -0.226384 -0.664678 0.286808 0.243164 0.206342 0.332026 0.235365 0.235524 0.275331 0.218070 0.370264 0.232332 0.230526 0.222684 0.246355 0.233624 0.232575
chargesum: 0.00000
title: Mulliken charges with hydrogens summed into heavy atoms:
elementType: O O O O N C C C C C C C C C C C C
charge: -0.232371 -0.078582 -0.278483 -0.278244 -0.066132 0.070518 0.077171 0.288342 0.181851 0.260023 0.209243 -0.070992 -0.129624 0.009766 -0.006660 0.006191 0.037985
polarizability: 2.02335239e+02 7.44847598e+00 1.23181432e+02 6.34991743e+00 -1.99257611e+01 1.27600558e+02
1716.lowfreq: -0.0009 -0.0008 -0.0006 1.7852 5.5553 10.9875 19.2411 24.4468 41.1340
frequency: 19.0873 24.4165 41.0941 59.4727 69.2058 81.1932 102.0208 146.7766 148.3881 186.2883 217.2341 229.2613 271.0836 290.8300 314.2603 343.7463 351.2527 401.5536 421.6111 449.5638 472.4520 570.3274 605.4759 615.2197 652.7951 679.8753 688.7071 701.0558 704.9419 725.5522 781.3629 794.8720 814.0097 832.4537 855.1375 883.1895 911.4524 937.3279 977.9589 985.3536 989.9101 1004.4063 1006.6016 1024.3993 1044.0178 1068.6441 1086.5274 1096.9227 1139.6718 1154.8994 1169.0588 1173.4110 1193.2168 1196.7258 1235.4738 1276.9693 1290.8587 1319.5072 1335.9569 1343.3326 1362.3714 1385.8446 1392.5911 1394.8717 1432.8621 1456.9125 1459.1929 1463.6537 1464.2384 1484.9188 1489.9487 1570.1127 1596.2741 1605.4666 1611.6586 2982.1636 2995.4279 3036.2876 3062.4666 3091.0748 3096.1674 3098.1342 3124.0132 3126.4004 3132.9452 3146.0198 3158.4102 3169.6620 3434.1374 3517.0779
redmass: 4.8142 4.0101 4.5430 6.8564 3.8565 5.0565 4.4036 4.8333 3.8551 2.4362 2.8923 1.8769 4.7328 3.9458 3.4243 4.6112 5.2865 2.7910 4.1646 4.0216 4.7760 2.0499 1.4360 5.0544 6.7341 1.6827 2.2822 2.3215 2.2808 6.7340 2.4648 2.3768 1.9440 2.7565 1.2521 4.0243 2.8701 1.4551 2.4361 1.4083 5.4991 2.5638 1.3447 2.4685 3.3056 2.2687 1.6514 2.1652 2.2861 1.7018 2.6663 1.0718 1.1466 1.3979 1.5617 1.1315 2.1289 1.3432 1.3727 1.3031 1.4455 9.1727 1.2092 1.2371 2.2150 1.1503 1.5711 1.1207 1.1142 1.0524 2.2695 7.2367 6.8749 6.9289 6.0527 1.0676 1.0361 1.0602 1.0844 1.0975 1.0979 1.1022 1.0860 1.1071 1.0878 1.0923 1.0959 1.1008 1.0652 1.0771
irintensity: 1.7883 0.4086 0.2255 4.5946 0.9527 3.1336 2.0664 4.6936 4.5349 4.0595 5.0200 5.9442 14.8956 7.4489 4.3506 16.5428 4.7614 0.1741 2.8032 15.0241 5.1625 87.6169 53.8658 3.5124 15.1518 151.8594 13.6949 54.8483 111.8890 18.0306 5.3534 19.2014 12.9324 4.5261 0.9462 13.1629 9.4396 2.8240 46.9152 0.7926 2.4759 37.9251 1.1141 13.3348 45.4134 50.5435 19.5153 14.8793 67.4756 5.3015 216.2866 2.7706 4.1600 83.3757 17.2458 11.7226 115.6881 6.8138 79.6942 37.0442 28.4289 1.3154 53.9937 19.0102 9.2350 27.9455 198.8922 41.0601 15.5041 12.1210 99.7710 113.1083 172.3502 32.5593 6.8992 63.7896 18.4607 20.8799 19.9556 30.9867 18.8692 3.6370 6.0609 24.0714 3.9191 22.9067 15.8952 21.7515 66.2229 43.4290
temp: 298.150 k
press: 1.00000 atm
elementType: 8 8 8 8 7 6 6 6 6 6 6 6 6 6 6 6 6 1 1 1 1 1 1 1 1 1 1 1 1 1 1 1
symmnumber: 1
zpe: 669009.6 jmol-1
zpe.correction: 0.254812 hartree
zpe.thermalcorrener: 0.271767 hartree
zpe.thermalcorrenthalpy: 0.272711 hartree
zpe.thermalcorrgfe: 0.207298 hartree
zpe.sumelectzpe: -820.661263 hartree
zpe.sumelectthermal: -820.644308 hartree
zpe.sumelectthermalent: -820.643364 hartree
zpe.sumelectthermalfe: -820.708777 hartree
dipole: 0.9023 -0.9173 -1.6942
dipole: 2.1274
quadrupole: -76.1095 -107.3233 -98.9219
quadrupole: -6.6308 4.3667 5.3584
quadrupole: 18.0087 -13.2051 -4.8037 -6.6308 4.3667 5.3584
hfenergy: -820.9160756 hartree
pointgroup: C01 [X(C12H15N1O4)]
dipole: 0.3036238 -0.7492225 -0.2168983 debye
polarizability: 202.3386518|-1.3415993|104.3841682|7.3775452|-0.1167405|146.3944091 unknown
InChI: InChI=1S/C12H15NO4/c1-2-17-12(16)10(8-14)13-11(15)9-6-4-3-5-7-9/h3-7,10,13-14H,2,8H2,1H3
charge 0 multiplicity 1
32 atoms
O  2.37059 -1.272034 1.038797
O  1.920657 1.812341 -2.012279
O  2.949617 -0.657708 -1.131297
O  -0.878219 0.25259 1.775373
N  0.067858 0.492043 -0.334345
C  1.412193 0.778234 0.182323
C  1.99064 2.007371 -0.558309
C  2.325473 -0.44098 -0.053757
C  -1.010179 0.251029 0.510925
C  -2.340619 0.008065 -0.154737
C  3.184565 -2.531476 0.916999
C  -3.498406 0.099044 0.66027
C  -2.48448 -0.318853 -1.529036
C  -4.778895 -0.110824 0.109163
C  -3.767165 -0.531689 -2.079622
C  -4.917651 -0.422719 -1.264328
C  4.641523 -2.264489 1.299442
H  1.318482 0.950531 1.268482
H  1.370779 2.892661 -0.345242
H  3.03122 2.20129 -0.2265
H  -0.055133 0.656668 -1.337623
H  2.686427 -3.218861 1.617749
H  3.095973 -2.903081 -0.118637
H  -3.362347 0.331211 1.7216
H  -1.607285 -0.441722 -2.17527
H  2.485011 1.013296 -2.215299
H  -5.666728 -0.033344 0.746183
H  -3.868468 -0.788587 -3.13971
H  5.203822 -3.216469 1.297599
H  5.121013 -1.581737 0.578064
H  4.709584 -1.827025 2.310174
H  -5.911948 -0.587176 -1.694354
