program: Gaussian 09
title: 000230649
version: EM64L-G09RevD.01
frameworkgroup: C1[X(C6H14O6S2)]
method: RPBEPBE
basis: SDD
operation: Freq
keyword: #p
keyword: freq=noraman
keyword: PBEPBE/SDD
title: #p freq=noraman PBEPBE/SDD
converged: YES YES NO NO
title: Mulliken charges:
elementType: S S O O O O O O C C C C C C H H H H H H H H H H H H H H
charge: 1.032591 1.032570 -0.398747 -0.398693 -0.514419 -0.522791 -0.514420 -0.522836 -0.319313 -0.319226 -0.609257 -0.609258 -0.487860 -0.487868 0.237638 0.250907 0.237667 0.250871 0.292389 0.298835 0.298785 0.292380 0.252029 0.239959 0.248033 0.239963 0.248032 0.252039
chargesum: 0.00000
title: Mulliken charges with hydrogens summed into heavy atoms:
elementType: S S O O O O O O C C C C C C
charge: 1.032591 1.032570 -0.398747 -0.398693 -0.514419 -0.522791 -0.514420 -0.522836 0.169232 0.169312 -0.018033 -0.018094 0.252162 0.252166
polarizability: 2.03401219e+02 -1.27301934e+01 1.22487276e+02 -1.14234266e-03 -2.14509908e-03 1.15852895e+02
1716.lowfreq: -4.2425 0.0011 0.0014 0.0027 4.3092 6.4903 12.8530 26.4680 32.0981
frequency: 12.3495 26.4678 31.7964 39.7956 51.3391 57.4884 88.2633 111.6450 113.2989 120.4881 123.3559 123.8213 153.9057 211.7168 218.1941 218.6341 220.0838 284.1958 284.3988 301.5927 314.6456 345.4486 358.7842 440.9395 441.0010 511.0980 534.2687 607.8069 623.5904 765.0957 783.9279 840.8543 841.8748 877.2997 926.1961 926.6051 936.5534 960.9890 1023.6322 1034.5338 1062.2263 1074.1010 1104.1896 1108.1393 1113.1285 1116.8797 1117.4471 1222.0454 1230.0220 1258.6082 1294.2788 1308.4775 1328.9669 1361.2101 1409.8032 1409.8737 1419.0031 1419.8664 1442.3641 1442.4337 1475.1283 1475.1766 1479.0546 1489.8098 2975.3338 2975.4244 2996.3715 3005.9898 3050.9728 3057.1224 3057.2513 3073.7916 3082.8711 3082.8852 3103.6814 3103.6971 3148.7475 3149.2575
redmass: 6.2751 5.8184 3.9567 3.5871 3.6293 4.4936 5.6541 1.8451 2.7448 4.2879 1.0896 1.2229 4.4522 4.0456 5.5274 4.3193 4.8523 7.0184 6.7274 4.9823 5.6508 8.7133 6.5085 5.9089 5.8189 13.8451 11.2234 5.9030 6.2595 1.0768 1.2102 13.9687 15.6814 1.6378 9.2338 9.2602 4.7203 3.8286 4.6576 3.9709 1.5927 3.0441 1.2169 1.3184 1.2289 1.2851 1.3032 1.3127 1.2491 1.2108 1.1719 1.0573 1.2673 1.3665 1.1166 1.1165 1.1010 1.1042 1.0495 1.0496 1.0559 1.0561 1.0756 1.0956 1.0282 1.0282 1.0595 1.0589 1.1031 1.0565 1.0560 1.1053 1.1053 1.1053 1.1033 1.1033 1.1110 1.1104
irintensity: 1.6361 3.7034 0.7131 2.7135 13.4350 1.8360 2.6512 0.1479 0.4594 0.7348 0.7079 0.0462 21.7027 1.5290 23.9205 1.7634 11.6144 17.8170 7.5340 30.6352 0.0003 16.7273 2.6270 48.0100 1.6492 13.2160 216.5607 13.4062 0.7360 8.5848 1.4246 8.1515 122.8073 12.2159 154.3803 0.2833 26.5249 130.6753 0.1804 6.5031 0.7222 0.0715 11.2214 18.7979 13.1918 6.0165 0.0323 5.1022 4.9993 0.0004 0.6370 2.4981 41.1293 0.0002 1.2826 7.7376 13.5944 0.0194 5.2806 27.0036 47.1860 2.4652 0.0198 19.7730 80.1803 0.0058 0.7497 12.5485 0.5559 0.0670 7.0144 12.5264 7.1411 37.9918 23.8626 2.6044 0.0330 0.8434
temp: 298.150 k
press: 1.00000 atm
elementType: 16 16 8 8 8 8 8 8 6 6 6 6 6 6 1 1 1 1 1 1 1 1 1 1 1 1 1 1
symmnumber: 1
zpe: 543784.1 jmol-1
zpe.correction: 0.207116 hartree
zpe.thermalcorrener: 0.226784 hartree
zpe.thermalcorrenthalpy: 0.227728 hartree
zpe.thermalcorrgfe: 0.154508 hartree
zpe.sumelectzpe: -1482.983219 hartree
zpe.sumelectthermal: -1482.963551 hartree
zpe.sumelectthermalent: -1482.962607 hartree
zpe.sumelectthermalfe: -1483.035827 hartree
dipole: 0.0018 -0.0004 0.2130
dipole: 0.2130
quadrupole: -89.9368 -108.2418 -111.0549
quadrupole: -25.9443 0.0025 0.0006
quadrupole: 13.1410 -5.1640 -7.9770 -25.9443 0.0025 0.0006
hfenergy: -1483.1903352 hartree
pointgroup: C01 [X(C6H14O6S2)]
dipole: -0.0007032 -0.0002251 0.0837944 debye
polarizability: 203.9196291|-10.947184|121.9687268|-0.0402909|0.0290771|115.8530338 unknown
InChI: InChI=1S/C6H14O6S2/c1-11-13(7,8)5-3-4-6-14(9,10)12-2/h3-6H2,1-2H3
charge 0 multiplicity 1
28 atoms
S  3.484389 0.505796 0.00217
S  -3.483889 -0.505256 -0.003275
O  4.54796 -0.948395 -0.521759
O  -4.54857 0.952491 -0.515015
O  3.387571 1.615917 -1.172464
O  3.927638 0.960546 1.495568
O  -3.387027 -1.605978 -1.186714
O  -3.925905 -0.972082 1.486775
C  0.65755 0.414134 0.047417
C  -0.657289 -0.413224 0.044579
C  1.86149 -0.530146 0.047401
C  -1.861378 0.530879 0.04932
C  5.979774 -0.748357 -0.219389
C  -5.980017 0.749382 -0.212923
H  0.689072 1.067842 0.939858
H  0.698579 1.065936 -0.845424
H  -0.68936 -1.072125 0.933176
H  -0.697701 -1.059793 -0.852097
H  1.977216 -1.131931 0.96197
H  1.938906 -1.156268 -0.855419
H  -1.93825 1.162359 -0.849809
H  -1.977873 1.127171 0.967379
H  6.121325 -0.402676 0.821513
H  6.444642 -0.042634 -0.930229
H  6.419795 -1.75254 -0.340305
H  -6.445237 0.049244 -0.929031
H  -6.420588 1.754323 -0.325238
H  -6.120424 0.395181 0.825267
