program: Gaussian 09
title: 000230636
version: EM64L-G09RevD.01
frameworkgroup: C1[X(C8H11ClN4O)]
method: RPBEPBE
basis: SDD
operation: Freq
keyword: #p
keyword: freq=noraman
keyword: PBEPBE/SDD
title: #p freq=noraman PBEPBE/SDD
converged: YES YES NO NO
title: Mulliken charges:
elementType: Cl O N N N N C C C C C C C C H H H H H H H H H H H
charge: -0.037099 -0.237378 -0.124263 -0.047629 -0.609206 0.046031 0.209618 0.154764 -0.226158 0.123499 -0.738721 -0.676021 -0.282781 -0.361016 0.236061 0.210707 0.250019 0.266677 0.249188 0.212470 0.229333 0.233637 0.248408 0.337119 0.332740
chargesum: 0.00000
title: Mulliken charges with hydrogens summed into heavy atoms:
elementType: Cl O N N N N C C C C C C C C
charge: -0.037099 -0.237378 -0.124263 -0.047629 0.060653 0.046031 0.209618 0.154764 0.220610 0.123499 0.027164 -0.000581 -0.282781 -0.112608
polarizability: 1.87636104e+02 -5.63190031e+00 1.39779471e+02 4.15479605e+00 6.22901257e-01 7.94853991e+01
1716.lowfreq: -14.4030 -8.5564 -4.2402 -0.0016 0.0020 0.0025 35.6240 47.7133 61.4597
frequency: 35.6059 47.5054 61.4437 67.7822 95.6062 113.0357 151.1545 176.4456 207.2977 232.3087 249.6614 283.2222 294.1620 349.1784 371.9739 431.2761 488.9176 503.5480 515.2093 545.1875 552.2458 563.9783 577.0955 605.7170 679.9395 749.2973 772.5987 800.6579 819.1124 909.7940 914.4773 921.0928 991.7455 1010.0399 1034.3807 1043.8643 1111.1708 1134.9931 1160.9301 1204.0629 1243.9779 1256.6242 1292.2498 1323.7746 1354.1389 1374.8534 1392.1014 1401.4333 1440.2489 1450.3029 1453.5491 1463.6954 1470.6782 1486.0891 1498.8808 1524.3363 1598.0082 1638.7024 2996.8298 3003.8851 3004.8011 3065.4686 3094.2362 3096.3346 3108.2866 3122.1467 3176.3411 3535.2990 3693.7795
redmass: 3.8196 1.3262 2.9528 2.1305 4.5674 4.2954 2.8435 2.9086 8.6339 5.4738 1.3380 5.0438 3.4291 4.1664 10.5336 3.1549 5.9044 1.4353 4.5503 2.6355 3.5184 1.2333 5.4181 6.8596 6.9690 7.6401 9.7401 1.1045 3.5100 6.3336 1.4556 5.8693 1.9453 1.7481 2.2471 1.6413 2.2560 1.4596 5.4687 4.5680 1.1801 3.2437 5.7063 3.8441 1.4692 1.9752 1.2364 1.2728 3.0098 1.0831 1.1338 1.0402 1.0674 1.0671 3.4688 4.8319 1.7849 7.4828 1.0363 1.0412 1.0532 1.1057 1.0986 1.0968 1.1022 1.1018 1.0926 1.0439 1.1052
irintensity: 0.4072 0.1314 0.1742 0.7748 1.1681 0.2034 4.5347 4.2256 0.4129 2.7410 1.6194 4.0698 10.0510 8.7559 13.3869 5.3660 8.9684 192.2136 0.6855 26.0474 51.5429 1.0531 7.3706 6.9627 18.2034 12.8027 5.4200 4.1618 15.1616 56.2534 12.5948 63.7028 20.3922 29.4532 77.3255 14.5814 16.7086 4.6706 14.7111 118.5776 23.8731 386.1493 11.8815 22.2165 3.5299 50.0973 53.6183 17.7872 9.8647 43.4943 30.9781 12.3507 9.0766 21.9715 172.1661 34.8875 349.5266 529.9368 25.0023 2.2177 21.0263 9.4368 26.2931 4.8444 39.2698 8.6737 15.4717 73.9632 60.3104
temp: 298.150 k
press: 1.00000 atm
elementType: 17 8 7 7 7 7 6 6 6 6 6 6 6 6 1 1 1 1 1 1 1 1 1 1 1
symmnumber: 1
zpe: 498476.5 jmol-1
zpe.correction: 0.189860 hartree
zpe.thermalcorrener: 0.204612 hartree
zpe.thermalcorrenthalpy: 0.205556 hartree
zpe.thermalcorrgfe: 0.146712 hartree
zpe.sumelectzpe: -1064.689519 hartree
zpe.sumelectthermal: -1064.674766 hartree
zpe.sumelectthermalent: -1064.673822 hartree
zpe.sumelectthermalfe: -1064.732667 hartree
dipole: 4.4201 3.2444 0.8951
dipole: 5.5556
quadrupole: -90.3921 -85.5084 -88.0079
quadrupole: -0.0977 -3.8912 -2.5758
quadrupole: -2.4226 2.4611 -0.0385 -0.0977 -3.8912 -2.5758
hfenergy: -1064.8793785 hartree
pointgroup: C01 [X(C8H11Cl1N4O1)]
dipole: 1.7224718 1.3367933 -0.1533636 debye
dipolederiv: -0.2568976 0.3233013 -0.0813128 0.2493503 -0.7154289 0.1390223 -0.0579563 0.1351277 -0.1287204 -1.858708 -0.0164101 0.2296545 -0.0878809 -0.2935919 0.045109 0.5234443 0.0396199 -0.6357038 -1.7071866 -0.014291 -0.0568465 0.2309098 -0.2576035 0.1076849 -0.4105304 0.0665659 -0.5217064 -0.4666428 -0.3940096 0.1086455 0.1225567 -0.6357381 0.1312535 -0.0408218 0.1232645 -0.2690896 -0.299542 -0.4977664 0.1529033 -0.2861426 -1.2241918 0.1664117 0.0497441 0.0779609 -0.6798032 -1.0880824 0.2569183 -0.1166829 0.1120378 -0.6371338 0.1422199 -0.06482 0.1188868 -0.1762569 1.0126397 0.2347842 0.0364575 -0.1118856 -0.7250816 0.1972381 0.0128713 0.2213722 0.0184329 2.2700384 -0.0216207 -0.0674927 -0.1949874 0.1859459 -0.2169024 0.3678966 -0.1334177 0.8382848 0.6845703 0.0190986 -0.1909133 0.0341012 0.3249331 -0.0120809 -0.5907129 -0.0186266 0.4798897 0.2240106 0.3979281 -0.1382083 0.456149 1.3646405 -0.3649284 -0.0645164 -0.365951 0.2934486 -0.1623165 0.0098472 0.0268591 0.1054523 0.0042 0.1813779 0.0588738 0.0943139 -0.2982207 -0.1440795 0.0147472 0.0396255 0.0133755 0.0616555 0.0022006 0.0560578 0.0024793 0.0465336 0.7278187 -0.3716721 0.0911891 -0.3134017 1.220729 -0.2609376 0.0175675 -0.2501135 0.0296539 0.5601679 0.0467872 -0.0034695 -0.2868501 0.6718516 -0.2376354 0.0861395 -0.2015393 0.009589 0.0055182 -0.0700788 -0.0525849 -0.0768306 -0.0139913 -0.0701838 0.0539055 -0.0391884 -0.0412233 -0.0091932 0.0894761 -0.0071776 0.059475 -0.1126003 0.0742219 0.1127719 0.0339147 -0.0052977 0.0087734 -0.0642539 -0.0957694 -0.0802217 0.0941465 -0.0849709 -0.0803567 -0.0294372 0.0413324 0.1502167 -0.0061207 0.0395392 0.0336234 -0.0327174 0.0310718 -0.0223745 -0.019649 0.0912948 -0.0398949 0.0544703 0.081784 0.0488333 0.0725958 -0.0141088 0.0479799 0.0089407 0.0885241 0.0155709 -0.006291 0.0698055 -0.0162204 0.1068593 0.0425791 0.1166957 0.037821 -0.1108843 0.0341084 -0.0441109 -0.0405648 -0.0682563 -0.0095842 -0.1019979 -0.115624 -0.1032144 0.019084 0.0631954 0.0263653 -0.0040101 0.0794842 -0.0995504 0.0533855 -0.064908 0.0666845 0.096129 -0.0846839 0.0044745 -0.0081114 0.0013635 0.0820953 0.0141335 -0.0064129 0.0100807 0.1288093 0.197018 0.0387155 -0.0079788 -0.0188239 0.271739 0.0046753 0.01574 0.0681448 0.3299599 0.1635807 -0.0102885 -0.0053405 -0.0052109 0.2958218 0.0311611 -0.0006537 0.0559595 0.3559404 unknown
polarizability: 187.6037765|-2.6361292|131.1281345|7.1751669|-20.9983479|88.169063 unknown
InChI: InChI=1S/C8H11ClN4O/c1-3-14-5(2)13-6-7(9)11-4-12-8(6)10/h4H,3,10H2,1-2H3
charge 0 multiplicity 1
25 atoms
Cl -0.704011 -2.6043 0.549859
O  2.851022 -0.020014 0.6356
N  0.667199 0.229179 -0.127296
N  -2.864867 1.30297 -0.535832
N  -0.831308 2.455461 -0.809024
N  -2.872611 -1.026042 0.13605
C  -0.73114 0.138257 -0.067761
C  1.48585 -0.047121 0.854731
C  3.324989 0.218161 -0.761034
C  -1.496815 1.30344 -0.475586
C  1.170187 -0.383395 2.291592
C  4.840937 0.05266 -0.738373
C  -1.527203 -1.001349 0.186499
C  -3.4877 0.139358 -0.209195
H  2.821336 -0.505089 -1.427163
H  3.015382 1.235454 -1.064773
H  1.9199 0.074886 2.956741
H  1.202456 -1.47756 2.43757
H  0.160581 -0.036087 2.56319
H  5.249479 0.224259 -1.750808
H  5.308089 0.77525 -0.047578
H  5.120821 -0.96545 -0.418916
H  -4.580367 0.133061 -0.236297
H  0.185945 2.443655 -0.850186
H  -1.37025 3.25716 -1.128211
