program: Gaussian 09
title: 000230617
version: EM64L-G09RevD.01
frameworkgroup: C1[X(C14H21NO2)]
method: RPBEPBE
basis: SDD
operation: Freq
keyword: #p
keyword: freq=noraman
keyword: PBEPBE/SDD
title: #p freq=noraman PBEPBE/SDD
converged: YES YES NO NO
title: Mulliken charges:
elementType: O O N C C C C C C C C C C C C C C H H H H H H H H H H H H H H H H H H H H H
charge: -0.287509 -0.437589 -0.090501 -0.117405 0.102093 -0.403661 -0.416749 -0.304472 0.319025 -0.341681 -0.618886 -0.392627 -0.384100 -0.704862 -0.229983 -0.229547 -0.238948 0.232375 0.201322 0.219671 0.228609 0.204411 0.212792 0.211814 0.185257 0.228939 0.219559 0.229206 0.206349 0.349341 0.261451 0.275958 0.209692 0.207683 0.214421 0.225722 0.225373 0.227457
chargesum: 0.00000
title: Mulliken charges with hydrogens summed into heavy atoms:
elementType: O O N C C C C C C C C C C C C C C
charge: -0.287509 -0.088248 -0.090501 0.114970 0.102093 0.017331 0.016270 0.120134 0.319025 0.072514 0.036228 -0.131176 -0.108141 -0.073066 -0.004261 -0.004174 -0.011491
polarizability: 1.97883695e+02 -1.78293237e+01 1.34351476e+02 1.82839453e+00 2.96877177e+00 1.49854358e+02
1716.lowfreq: -13.3609 -3.2580 -0.0007 -0.0006 0.0004 11.3444 44.1533 53.4267 61.0387
frequency: 44.0696 53.3786 60.9719 72.2381 91.2391 120.7955 157.7706 188.1184 219.2447 221.9763 238.4648 245.1741 256.2032 304.3048 310.6672 316.1833 333.3620 397.3786 409.4377 425.1657 432.8683 438.1503 501.4004 536.9651 563.8315 592.7881 615.6937 657.8643 707.8478 723.2383 747.4488 763.0815 778.0936 835.8526 860.4042 861.7907 880.2663 904.8871 935.5604 941.2204 974.5844 978.7231 985.2893 989.5479 1000.2078 1011.2808 1025.1427 1039.8405 1049.9331 1053.3911 1079.9518 1086.3421 1106.7174 1119.0677 1121.4783 1152.5021 1171.3467 1182.7219 1205.4459 1217.9240 1232.5108 1241.2721 1258.2135 1289.9395 1293.0138 1297.6579 1304.7184 1312.0543 1336.4149 1350.2405 1351.8216 1365.4281 1382.1008 1389.0004 1432.0416 1434.4284 1441.3945 1448.4912 1463.9599 1471.2500 1476.1261 1477.6323 1478.3992 1489.4152 1496.7659 1589.4354 1611.1748 2931.6760 2967.0418 2968.9924 2980.1686 2987.0272 2997.5556 3012.3396 3017.7479 3026.1326 3046.1238 3050.0344 3067.2587 3068.2344 3069.2313 3080.6286 3122.8832 3132.8392 3146.4994 3159.9046 3176.5380 3532.4932
redmass: 3.7415 3.8314 2.5024 2.2726 3.0559 2.9820 2.9669 3.1274 1.2412 2.1472 1.5578 2.5620 2.9517 4.2516 2.7856 3.4675 3.2987 1.7137 2.1970 3.3507 2.5174 3.7372 3.0858 2.8905 3.0553 4.1086 6.3396 5.0317 1.8474 1.8684 2.9554 1.4111 2.0377 3.3646 1.3272 1.4908 2.5165 2.0642 1.5343 2.2911 3.0364 2.4981 1.3725 6.1923 1.3266 3.1199 2.2768 2.4703 2.2637 2.7653 1.7079 1.7341 2.0824 1.5157 2.1152 1.9391 1.0538 1.1211 1.8514 1.5783 1.6894 1.7094 1.2770 1.2304 1.3236 1.7721 1.3986 1.3314 1.2814 1.2606 1.5665 1.4716 7.7005 1.2160 1.1830 2.0269 1.1076 1.0822 1.0713 1.0741 1.0525 1.0670 2.1992 1.0850 1.0499 6.3065 6.1295 1.0406 1.0515 1.0486 1.0619 1.0608 1.0612 1.0848 1.0920 1.0940 1.1002 1.1005 1.0998 1.0988 1.0999 1.1052 1.0847 1.0886 1.0938 1.0986 1.0961 1.0653
irintensity: 0.0361 0.2550 0.1282 0.1015 0.9586 1.3372 0.8038 0.3441 0.3775 3.1208 0.5345 0.7704 3.8633 11.7668 1.3005 2.6673 1.8419 59.1522 32.9641 28.7926 0.6706 5.8734 14.6254 7.4751 28.4221 12.7948 0.3756 17.3041 44.4098 8.7820 66.0300 35.9449 5.7902 4.2113 5.0196 1.4600 66.3484 12.9172 8.1886 48.8112 7.7154 19.4494 0.7896 0.3357 0.1867 67.5804 39.1591 63.0842 7.8328 3.7238 25.4053 4.0329 6.8375 14.3510 18.6587 5.6702 0.2659 5.4438 3.1702 20.8999 2.5033 1.3783 10.0042 8.2782 11.2467 38.9122 3.5475 3.7859 1.3830 3.4164 5.9229 4.3389 0.2554 11.1464 4.1168 19.6875 10.7520 4.3455 10.8302 0.9656 5.9810 6.6511 18.0206 12.5333 11.5393 0.7170 5.2538 103.8360 32.7800 20.8634 37.3847 44.5884 51.1157 14.4028 45.5443 4.6404 35.6082 19.8039 45.4136 36.1244 107.7177 32.7049 0.4456 9.8639 26.4744 27.5047 6.5530 4.1442
temp: 298.150 k
press: 1.00000 atm
elementType: 8 8 7 6 6 6 6 6 6 6 6 6 6 6 6 6 6 1 1 1 1 1 1 1 1 1 1 1 1 1 1 1 1 1 1 1 1 1
symmnumber: 1
zpe: 852656.8 jmol-1
zpe.correction: 0.324760 hartree
zpe.thermalcorrener: 0.341828 hartree
zpe.thermalcorrenthalpy: 0.342772 hartree
zpe.thermalcorrgfe: 0.280426 hartree
zpe.sumelectzpe: -749.947092 hartree
zpe.sumelectthermal: -749.930024 hartree
zpe.sumelectthermalent: -749.929079 hartree
zpe.sumelectthermalfe: -749.991426 hartree
dipole: -0.0505 -0.7271 0.0918
dipole: 0.7346
quadrupole: -95.4846 -103.4950 -99.0380
quadrupole: -4.8022 3.6613 -0.2483
quadrupole: 3.8546 -4.1558 0.3012 -4.8022 3.6613 -0.2483
hfenergy: -750.2718515 hartree
pointgroup: C01 [X(C14H21N1O2)]
dipole: -0.0258496 0.2878517 -0.0003389 debye
polarizability: 197.1100223|19.2338764|134.6320468|0.4125744|0.9887552|150.3474607 unknown
InChI: InChI=1S/C14H21NO2/c1-3-7-13-14(16,17-11-10-15(13)2)12-8-5-4-6-9-12/h4-6,8-9,13,16H,3,7,10-11H2,1-2H3
charge 0 multiplicity 1
38 atoms
O  0.363902 1.5021 -1.120586
O  0.163743 1.91684 1.244096
N  2.493824 0.291418 0.444566
C  1.100124 -0.208643 0.559419
C  0.044416 0.899501 0.182565
C  0.898332 -1.49917 -0.278916
C  2.761699 0.920915 -0.868039
C  1.748879 2.037297 -1.188429
C  -1.395032 0.402811 0.095409
C  1.893747 -2.615905 0.09904
C  3.038587 1.020132 1.609773
C  -2.090625 0.112746 1.297943
C  -2.045491 0.207653 -1.147476
C  1.714518 -3.882394 -0.764997
C  -3.416553 -0.371334 1.256175
C  -3.374175 -0.270733 -1.186633
C  -4.063303 -0.565274 0.012921
H  0.923103 -0.456962 1.623605
H  0.983036 -1.270093 -1.360286
H  -0.134297 -1.8642 -0.122958
H  2.709361 0.148886 -1.659477
H  3.790637 1.32729 -0.868301
H  1.845683 2.878869 -0.475837
H  1.848247 2.410238 -2.221843
H  1.759128 -2.875707 1.169785
H  2.923324 -2.223446 0.004129
H  2.843074 0.430422 2.523198
H  2.608254 2.032494 1.7679
H  4.13588 1.109243 1.493916
H  -0.548968 2.590991 1.091064
H  -1.591786 0.275431 2.259844
H  -1.504862 0.443796 -2.067871
H  0.693499 -4.297622 -0.663511
H  1.876986 -3.657274 -1.836485
H  2.430778 -4.673346 -0.474789
H  -3.945479 -0.59322 2.190112
H  -3.871672 -0.413673 -2.152667
H  -5.093218 -0.938474 -0.01986
