program: Gaussian 09
title: 000021883
version: EM64L-G09RevD.01
frameworkgroup: C1[X(C10H19O6P)]
method: RPBEPBE
basis: SDD
operation: Freq
keyword: #p
keyword: freq=noraman
keyword: PBEPBE/SDD
title: #p freq=noraman PBEPBE/SDD
converged: YES YES NO NO
title: Mulliken charges:
elementType: P O O O O O O C C C C C C C C C C H H H H H H H H H H H H H H H H H H H
charge: 1.411404 -0.530585 -0.501305 -0.542243 -0.586518 -0.273333 -0.277138 -0.218299 -0.216290 0.431575 -0.654556 -0.656947 -0.767321 -0.454847 0.233732 -0.222953 -0.672618 0.235123 0.230189 0.240862 0.224392 0.236658 0.231550 0.214609 0.238193 0.236862 0.210196 0.238858 0.299725 0.234188 0.306135 0.225739 0.225103 0.231115 0.231587 0.207157
chargesum: 0.00000
title: Mulliken charges with hydrogens summed into heavy atoms:
elementType: P O O O O O O C C C C C C C C C C
charge: 1.411404 -0.530585 -0.501305 -0.542243 -0.586518 -0.273333 -0.277138 0.247013 0.248964 0.431575 0.028261 0.028305 0.005451 -0.148712 0.233732 0.227889 -0.002759
polarizability: 2.14753762e+02 2.29465083e+00 1.37362280e+02 -1.17498158e+01 1.64579182e+00 1.45364783e+02
1716.lowfreq: -5.1323 -0.0022 -0.0021 -0.0020 2.8113 4.4321 6.9413 24.2828 28.8638
frequency: 5.7180 24.1744 28.8279 38.6435 44.5384 53.8442 58.4175 67.0489 75.4680 87.4128 119.1458 140.9445 141.7637 149.8600 200.6322 204.5995 233.8817 237.0619 246.3754 254.3739 270.1792 279.9509 286.1834 291.0592 332.2615 376.0809 387.5561 433.5475 455.9264 485.9398 504.6143 605.9196 666.1654 695.6502 709.1244 731.3756 798.7572 809.7950 811.4948 826.0122 860.3431 874.7524 882.6677 895.9488 968.4416 1010.3997 1013.6021 1021.7392 1037.4113 1052.5256 1061.3379 1102.4634 1105.9988 1108.8860 1116.3873 1132.0219 1133.9961 1134.6590 1204.8697 1246.4447 1251.0829 1256.8688 1345.1380 1352.7577 1358.9160 1373.3422 1395.3173 1396.2124 1397.8339 1401.6544 1447.4861 1456.9057 1457.9457 1461.7898 1473.6430 1473.8847 1477.6401 1478.2779 1486.8357 1488.2943 1489.0563 1603.3569 1646.2648 2987.0215 2995.1119 2995.2535 2996.2968 2998.7261 3005.6859 3006.5618 3062.2843 3063.0972 3069.6903 3074.3717 3091.9411 3093.3486 3093.4459 3107.1085 3112.5016 3116.0479 3121.2241 3152.3715
redmass: 4.2946 3.5243 2.8659 2.5399 2.2762 2.8584 2.3431 4.7375 2.8794 3.6604 3.5577 1.2588 3.2381 5.0604 2.2962 3.9352 1.3986 1.3881 3.5835 1.6417 3.4916 3.9922 3.8388 4.0080 6.3726 5.4681 3.8345 5.6546 6.9258 8.2513 2.7221 5.7953 6.7374 5.7366 5.8849 6.4651 1.0999 1.0876 1.0904 3.8441 5.0142 4.0353 4.2586 1.4909 4.9394 2.4294 1.9021 2.5068 2.6930 1.5051 8.3799 2.3639 2.2328 2.4565 2.3187 1.3978 1.4186 1.4641 4.9303 1.1378 1.1546 1.1457 1.3348 1.2535 1.2460 1.4128 1.2450 1.2421 1.2820 1.4249 1.0897 1.0392 1.0398 1.0403 1.0596 1.0486 1.0530 1.0527 1.0679 1.0834 1.0823 9.4231 6.7196 1.0364 1.0421 1.0360 1.0365 1.0501 1.0578 1.0574 1.1088 1.1066 1.0970 1.1074 1.0985 1.0977 1.0979 1.1022 1.1026 1.1029 1.1000 1.0918
irintensity: 0.9035 0.2453 0.7308 0.3496 2.0445 3.5069 3.5605 1.0519 3.4921 1.1371 0.0781 0.4772 1.7630 1.5514 0.7023 0.2056 0.8448 1.7919 6.1379 0.6447 7.6656 14.7525 10.7227 13.1543 34.0974 4.9493 24.2092 41.2954 14.5584 34.8935 3.8627 21.7601 225.5149 8.3702 68.2744 36.3278 4.0591 1.6495 4.9133 73.4628 87.6264 135.8258 231.0298 113.1505 379.7164 147.4864 62.4714 85.0591 153.7608 3.7893 41.6307 216.5800 6.4792 106.2433 131.1504 4.3625 5.9339 5.4011 155.4171 0.0094 0.9957 0.0260 50.3458 1.9524 5.6721 47.1361 25.1260 27.4446 22.7467 58.4048 62.6802 12.1760 13.4421 11.6260 7.6050 17.2501 3.7350 6.7026 12.0550 11.1333 10.2690 218.5696 455.0051 25.4424 22.0602 21.6225 17.6144 24.5497 23.6996 23.5082 9.8591 11.2584 12.5478 9.1114 33.7227 18.4010 30.7962 43.4288 32.0694 35.0156 3.6698 4.8541
temp: 298.150 k
press: 1.00000 atm
elementType: 15 8 8 8 8 8 8 6 6 6 6 6 6 6 6 6 6 1 1 1 1 1 1 1 1 1 1 1 1 1 1 1 1 1 1 1
symmnumber: 1
zpe: 749148.3 jmol-1
zpe.correction: 0.285336 hartree
zpe.thermalcorrener: 0.307853 hartree
zpe.thermalcorrenthalpy: 0.308797 hartree
zpe.thermalcorrgfe: 0.228385 hartree
zpe.sumelectzpe: -1183.641558 hartree
zpe.sumelectthermal: -1183.619041 hartree
zpe.sumelectthermalent: -1183.618097 hartree
zpe.sumelectthermalfe: -1183.698509 hartree
dipole: -3.0992 0.0342 2.1182
dipole: 3.7541
quadrupole: -90.4488 -97.6773 -117.8170
quadrupole: 2.7000 -10.6782 1.5013
quadrupole: 11.5323 4.3037 -15.8360 2.7000 -10.6782 1.5013
hfenergy: -1183.9268939 hartree
pointgroup: C01 [X(C10H19O6P1)]
dipole: -1.1848954 0.4836657 -0.7372616 debye
polarizability: 213.0081117|-2.3808295|138.7869529|15.9846782|-3.8462717|145.685761 unknown
InChI: InChI=1S/C10H19O6P/c1-5-13-10(11)8-9(4)16-17(12,14-6-2)15-7-3/h8H,5-7H2,1-4H3
charge 0 multiplicity 1
36 atoms
P  -1.654024 -1.009113 0.222285
O  -3.287952 -0.488954 0.232502
O  -1.680298 -2.212918 -0.983619
O  -0.961317 0.413095 -0.576723
O  -0.988431 -1.458363 1.584298
O  3.514143 -0.387522 0.888637
O  3.391748 1.33978 -0.675159
C  -3.707587 0.556421 1.221528
C  -2.371487 -1.970453 -2.29669
C  0.41122 0.761593 -0.65111
C  -5.227513 0.632691 1.134851
C  -2.15195 -3.2387 -3.112628
C  0.570983 1.911243 -1.605092
C  1.377418 0.121052 0.077238
C  2.809492 0.457995 0.015908
C  4.989334 -0.174481 0.948223
C  5.53575 -1.180853 1.956112
H  -3.364653 0.252553 2.228202
H  -3.22718 1.511577 0.939067
H  -3.439444 -1.77576 -2.094833
H  -1.919095 -1.08198 -2.775207
H  -5.682281 -0.336322 1.400022
H  -5.547816 0.906139 0.11529
H  -5.602273 1.400618 1.836557
H  -2.582958 -4.112784 -2.596702
H  -1.076114 -3.420821 -3.272344
H  -2.642319 -3.135664 -4.098625
H  -0.044515 2.765263 -1.267784
H  1.628348 2.209722 -1.659504
H  0.211174 1.623701 -2.609987
H  1.11353 -0.685383 0.769392
H  5.180554 0.872515 1.247007
H  5.405612 -0.32043 -0.06549
H  5.315438 -2.214475 1.639034
H  5.089037 -1.021601 2.952349
H  6.632026 -1.068082 2.042595
