program: Gaussian 09
title: 000230610
version: EM64L-G09RevD.01
frameworkgroup: C1[X(C22H17NO2)]
method: RPBEPBE
basis: SDD
operation: Freq
keyword: #p
keyword: freq=noraman
keyword: PBEPBE/SDD
title: #p freq=noraman PBEPBE/SDD
converged: YES YES NO NO
title: Mulliken charges:
elementType: O O N C C C C C C C C C C C C C C C C C C C C C C H H H H H H H H H H H H H H H H H
charge: -0.286006 -0.261353 -0.035133 0.259266 0.180093 0.019224 0.288163 0.385713 0.149391 -0.134812 -0.422780 -0.395436 -0.383541 -0.450948 -0.246254 -0.367733 -0.437952 -0.327010 -0.264261 0.171199 -0.248698 -0.248323 -0.227691 -0.219111 -0.671537 0.315889 0.263913 0.262370 0.239770 0.229874 0.299928 0.237565 0.265906 0.227881 0.229410 0.231227 0.233443 0.231878 0.230091 0.213682 0.230233 0.232468
chargesum: 0.00000
title: Mulliken charges with hydrogens summed into heavy atoms:
elementType: O O N C C C C C C C C C C C C C C C C C C C C C C
charge: -0.286006 -0.261353 -0.035133 0.259266 0.180093 0.019224 0.288163 0.385713 0.149391 -0.134812 -0.106890 -0.131523 -0.121170 -0.211178 -0.016380 -0.067805 -0.200388 -0.061104 -0.036379 0.171199 -0.019288 -0.017096 0.005751 0.242858 0.004847
polarizability: 3.96297202e+02 3.92910572e+01 2.93923128e+02 -1.71979968e+01 3.03765458e+01 1.46690192e+02
1716.lowfreq: -5.5544 -1.4944 -0.0002 0.0004 0.0010 5.1741 16.5030 29.8296 45.2936
frequency: 16.4588 29.7938 45.2814 48.9053 62.8180 81.8451 94.4777 126.6798 151.4026 172.2785 176.8204 198.7496 223.0441 241.0126 254.4569 256.1120 308.3098 314.9881 361.0591 386.6865 411.4777 421.0388 425.6478 470.9763 491.4081 503.9156 510.5138 519.8262 539.0615 563.8075 574.3830 594.0411 636.8802 649.8471 692.5908 701.5570 731.0614 745.1032 751.6790 783.5968 785.8586 786.5886 790.4919 796.9703 798.5596 814.3210 820.0285 860.7284 882.4170 887.5806 895.3463 924.5549 952.1996 970.6917 972.2561 983.8463 988.3026 995.2435 1000.5307 1007.7319 1024.6097 1029.4392 1031.6220 1069.8463 1105.2827 1112.6416 1128.2014 1135.6132 1148.1492 1155.8555 1176.5041 1180.4445 1192.7086 1225.0390 1234.4843 1248.0510 1257.6044 1269.5109 1283.7118 1319.8555 1338.2475 1358.7146 1370.9774 1379.8340 1401.1090 1403.6381 1409.8482 1411.6110 1438.6153 1448.2420 1459.7812 1463.7569 1473.0586 1486.0427 1500.1047 1516.7625 1534.2537 1572.0154 1585.3711 1592.1401 1611.7238 1618.3239 1629.0113 2996.3289 3010.6728 3069.1920 3092.8139 3108.0615 3121.0038 3124.3411 3133.1453 3133.1755 3146.6184 3150.6877 3151.4593 3164.9888 3166.1996 3170.6056 3186.6089 3192.9879
redmass: 4.3079 5.2323 4.7106 5.1485 3.3538 3.2816 3.8402 3.1627 3.9695 4.8832 4.1526 5.0114 3.2131 4.7693 1.6748 3.6211 5.2809 5.6864 8.2801 3.8689 4.1032 3.4628 3.8741 3.2883 5.2056 4.6928 7.0042 4.7659 6.0053 5.7310 4.5619 5.0970 4.6952 5.0209 4.9653 3.6145 4.1695 3.7765 1.8583 4.1396 2.0763 1.5559 4.6971 2.7707 1.2234 2.3280 2.2647 4.7510 1.8773 5.2867 1.5370 1.4103 1.4574 1.3770 5.0542 1.3539 1.3844 1.3314 5.5635 1.3193 2.4295 2.5294 2.2990 2.2242 2.4285 2.2057 2.6639 1.4671 1.5583 1.3141 1.0992 1.3488 1.3186 1.7972 1.9288 1.1334 1.6850 1.7390 2.8488 3.4288 3.1991 1.4759 3.0615 4.0245 1.3246 2.3823 2.9785 5.9652 2.5637 2.4339 3.0394 1.0401 1.0618 1.0729 3.8540 3.9487 7.1871 7.6399 7.4302 5.3603 9.6573 6.5081 6.5267 1.0359 1.0582 1.1066 1.0985 1.1026 1.0865 1.0870 1.0882 1.0871 1.0925 1.0915 1.0942 1.0994 1.0978 1.0976 1.0955 1.0919
irintensity: 0.5373 0.4047 0.3312 0.4470 0.8502 0.0107 0.5069 4.0372 0.3928 0.4532 0.7888 1.6663 5.6985 1.9607 3.4391 0.4951 0.1217 11.4184 2.9923 5.3932 2.1393 6.9688 2.7554 0.0855 5.1677 2.5576 2.3934 7.7261 5.9022 3.2670 9.3044 8.1607 2.8895 2.1825 2.8343 1.5412 1.2644 1.3693 4.3611 20.7377 107.3570 32.5855 11.4301 2.6895 0.0840 34.9238 29.0330 2.5866 5.2413 6.9796 0.1539 2.1592 9.7958 4.3478 49.6433 4.5579 1.8942 1.8176 1.6883 0.8506 70.1931 52.9727 5.3161 7.7331 53.8962 5.6041 193.4937 6.0573 96.6325 7.5974 3.0001 58.4437 6.1863 97.2073 2.3184 0.0046 38.4236 20.8054 5.2224 29.6173 28.6955 15.8142 8.3528 5.4711 21.8685 1.1463 5.0948 0.3162 4.4305 3.5144 1.3667 13.1962 6.8697 15.1745 33.2873 10.4186 99.4227 112.2132 1.7975 3.4303 96.1621 1.9180 0.1439 17.9424 20.3349 7.1451 32.3132 39.7515 1.5572 2.9755 3.6642 11.1516 22.0612 21.3768 43.0757 35.8429 4.6318 16.8041 18.3457 0.6774
temp: 298.150 k
press: 1.00000 atm
elementType: 8 8 7 6 6 6 6 6 6 6 6 6 6 6 6 6 6 6 6 6 6 6 6 6 6 1 1 1 1 1 1 1 1 1 1 1 1 1 1 1 1 1
symmnumber: 1
zpe: 859128.6 jmol-1
zpe.correction: 0.327225 hartree
zpe.thermalcorrener: 0.347679 hartree
zpe.thermalcorrenthalpy: 0.348624 hartree
zpe.thermalcorrgfe: 0.276180 hartree
zpe.sumelectzpe: -1052.059663 hartree
zpe.sumelectthermal: -1052.039208 hartree
zpe.sumelectthermalent: -1052.038264 hartree
zpe.sumelectthermalfe: -1052.110708 hartree
dipole: 1.0583 2.0232 -0.3673
dipole: 2.3126
quadrupole: -132.1790 -125.2857 -144.9466
quadrupole: 5.7859 -3.0438 4.1275
quadrupole: 1.9581 8.8514 -10.8095 5.7859 -3.0438 4.1275
hfenergy: -1052.3868876 hartree
pointgroup: C01 [X(C22H17N1O2)]
dipole: -0.1904971 -0.8896016 0.0129976 debye
polarizability: 367.9116874|65.1566091|306.4749653|19.7525318|-52.5064805|162.5238694 unknown
InChI: InChI=1S/C22H17NO2/c1-2-25-22(24)19-14-21(23-20-13-6-5-11-18(19)20)17-12-7-9-15-8-3-4-10-16(15)17/h3-14H,2H2,1H3
charge 0 multiplicity 1
42 atoms
O  2.318151 -2.355391 0.201309
O  4.262974 -1.090392 0.238107
N  0.169527 2.151527 -0.230127
C  -1.698505 0.606223 -0.409671
C  -2.44201 -0.396809 0.326738
C  -0.240144 0.859748 -0.203672
C  2.538965 1.395788 0.059239
C  -3.829888 -0.636463 -0.031502
C  2.069618 0.025323 0.054939
C  1.521753 2.424665 -0.10004
C  0.695907 -0.221343 -0.077166
C  -2.35441 1.369579 -1.3899
C  -1.90032 -1.131617 1.436911
C  -4.44144 0.14012 -1.069033
C  -3.720776 1.141096 -1.722505
C  3.906575 1.80398 0.196876
C  -4.581994 -1.630991 0.67875
C  1.906261 3.804829 -0.120533
C  -2.661895 -2.084473 2.11822
C  3.008164 -1.139602 0.170504
C  -4.011118 -2.351777 1.72798
C  4.246983 3.160147 0.17504
C  3.246099 4.169149 0.015152
C  3.163794 -3.583894 0.302914
C  2.210641 -4.774069 0.295277
H  0.34413 -1.253008 -0.121836
H  -1.782942 2.144006 -1.910678
H  -0.883047 -0.919804 1.778839
H  -5.487742 -0.057241 -1.331394
H  -4.193808 1.745552 -2.503738
H  4.675513 1.037518 0.311632
H  -5.625069 -1.805627 0.388256
H  1.108946 4.544413 -0.240187
H  -2.22678 -2.623995 2.96673
H  -4.595536 -3.106015 2.266046
H  5.297093 3.454231 0.281489
H  3.535134 5.225713 0.001595
H  3.865074 -3.593433 -0.550964
H  3.757006 -3.518584 1.233052
H  2.788156 -5.71322 0.373244
H  1.510201 -4.725897 1.146493
H  1.623263 -4.804461 -0.638187
