program: Gaussian 09
title: 000230602
version: EM64L-G09RevD.01
frameworkgroup: C1[X(C18H15NO2)]
method: RPBEPBE
basis: SDD
operation: Freq
keyword: #p
keyword: freq=noraman
keyword: PBEPBE/SDD
title: #p freq=noraman PBEPBE/SDD
converged: YES YES NO NO
title: Mulliken charges:
elementType: O O N C C C C C C C C C C C C C C C C C C H H H H H H H H H H H H H H H
charge: -0.439530 -0.255716 -0.036075 0.246873 0.026726 0.321335 0.292182 -0.116774 0.173637 -0.402701 -0.379562 -0.577894 0.464143 -0.436595 -0.810988 -0.366845 -0.331392 -0.812603 -0.249067 -0.226052 0.112075 0.294343 0.240967 0.233637 0.232938 0.227226 0.212951 0.258039 0.298143 0.263251 0.226837 0.224774 0.237214 0.232095 0.233815 0.388594
chargesum: 0.00000
title: Mulliken charges with hydrogens summed into heavy atoms:
elementType: O O N C C C C C C C C C C C C C C C C C C
charge: -0.050935 -0.255716 -0.036075 0.246873 0.026726 0.321335 0.292182 -0.116774 0.173637 -0.108359 -0.138595 -0.344257 0.464143 -0.203657 -0.112772 -0.068702 -0.068141 -0.123779 -0.016972 0.007763 0.112075
polarizability: 3.61701837e+02 -2.79569730e+01 2.31668929e+02 -1.42977354e+00 -6.15082387e+00 1.02777355e+02
1716.lowfreq: -5.9964 -2.8482 -0.0007 -0.0001 0.0003 6.9473 32.4195 34.4763 36.8523
frequency: 32.3933 34.4132 36.8427 48.8685 66.0158 99.4725 137.7665 143.5520 178.6017 190.4687 198.7214 216.8404 244.5725 284.2408 295.4099 340.9960 364.5496 370.7530 408.9194 444.6578 450.4936 502.7383 505.4502 519.1940 527.1025 554.9238 564.0385 585.7061 607.8948 610.2077 630.6274 686.3945 718.6237 723.3812 729.0199 752.9669 787.2877 795.4483 825.4237 841.9917 852.3217 892.5937 894.6449 930.7753 945.5584 954.0298 963.6075 983.0431 985.7238 1007.5929 1023.9771 1024.8290 1043.4702 1047.8282 1055.3972 1066.7138 1126.0012 1152.3382 1168.8529 1181.1248 1206.3513 1244.2256 1253.6830 1279.8001 1281.8921 1296.5590 1320.2871 1352.1055 1371.0364 1379.0265 1396.2469 1398.7856 1404.0233 1413.5541 1450.2543 1454.4954 1470.4034 1473.0908 1474.3879 1494.3164 1509.1149 1536.1925 1573.4903 1577.9200 1616.5556 1622.8354 1636.3906 2974.2608 2988.5525 3055.2822 3075.0555 3084.7142 3087.7757 3111.6390 3120.1557 3134.1565 3144.2864 3151.0368 3170.1346 3185.8569 3191.7864 3529.2909
redmass: 3.3120 1.0915 8.6518 4.7880 4.7311 4.5774 4.1234 1.1113 5.6513 4.5479 2.7517 4.8064 5.5348 4.2645 3.1336 4.9386 7.8751 6.0331 3.5140 2.8827 3.3030 3.3580 4.7575 5.2605 4.6301 5.1629 3.0181 4.5756 5.4704 1.4191 5.2875 3.4921 5.5859 5.1709 3.9055 3.7547 1.5082 3.4954 1.6430 3.9986 5.9505 1.2892 1.5230 3.0575 1.5691 6.7382 1.3997 1.3537 1.4879 1.3201 2.3577 1.5070 1.5413 1.7309 3.1851 2.6318 1.6968 1.5665 1.1945 1.5148 1.6573 2.1749 1.9674 2.8060 2.0381 1.7005 4.0406 3.9327 6.7216 4.1308 1.4141 1.7648 1.3623 2.8995 2.0701 1.2646 1.1214 1.0607 1.1933 3.0615 3.3409 7.1033 6.6109 6.9956 6.1218 6.2782 8.5051 1.0386 1.0366 1.0949 1.0970 1.0998 1.0997 1.0911 1.0869 1.0865 1.0966 1.0913 1.0978 1.0957 1.0917 1.0642
irintensity: 0.2238 0.3519 0.7985 1.4061 0.4004 0.0954 0.4507 1.5795 0.4604 3.8326 4.0917 0.3992 1.4426 0.5772 1.2693 2.1670 0.2415 1.9080 9.7750 6.3508 5.1676 1.5530 1.0767 5.2635 2.5011 1.7455 24.2124 34.4670 28.7504 127.7692 14.9927 4.0521 2.8104 0.8978 1.8047 2.2945 100.3761 2.7728 33.7793 7.2970 5.8307 3.1627 0.3269 4.5243 9.0238 77.5847 1.1057 4.3308 0.9259 0.7274 2.5637 2.1876 2.6617 23.2067 19.0711 291.9506 42.9154 2.2720 5.9825 1.4408 4.9723 4.6465 34.1556 11.6436 14.8909 3.1491 54.0986 30.8171 16.9374 10.9451 18.1268 2.1785 10.7930 2.0240 3.0719 17.2564 4.9361 13.6307 44.3279 35.4489 6.0313 111.6292 40.2591 84.6954 19.9866 27.7136 191.1950 42.0115 25.2526 23.0160 21.3971 16.9441 22.5000 32.8279 19.5687 6.1199 17.4164 17.7319 16.2259 15.7078 0.9188 54.2565
temp: 298.150 k
press: 1.00000 atm
elementType: 8 8 7 6 6 6 6 6 6 6 6 6 6 6 6 6 6 6 6 6 6 1 1 1 1 1 1 1 1 1 1 1 1 1 1 1
symmnumber: 1
zpe: 734796.6 jmol-1
zpe.correction: 0.279869 hartree
zpe.thermalcorrener: 0.298124 hartree
zpe.thermalcorrenthalpy: 0.299068 hartree
zpe.thermalcorrgfe: 0.231969 hartree
zpe.sumelectzpe: -898.691871 hartree
zpe.sumelectthermal: -898.673617 hartree
zpe.sumelectthermalent: -898.672672 hartree
zpe.sumelectthermalfe: -898.739771 hartree
dipole: -1.2704 0.5008 0.1602
dipole: 1.3749
quadrupole: -110.0535 -106.5542 -125.1461
quadrupole: -5.6087 -0.5716 -1.7144
quadrupole: 3.8644 7.3638 -11.2282 -5.6087 -0.5716 -1.7144
hfenergy: -898.9717403 hartree
pointgroup: C01 [X(C18H15N1O2)]
dipole: -0.500056 0.2060374 -0.0097154 debye
polarizability: 362.0302156|-27.659504|205.3907687|3.7311942|-51.5992941|128.7271374 unknown
InChI: InChI=1S/C18H15NO2/c1-11-7-8-13(12(2)9-11)17-10-15(18(20)21)14-5-3-4-6-16(14)19-17/h3-10,20H,1-2H3
charge 0 multiplicity 1
36 atoms
O  1.684671 3.440151 -1.073366
O  3.800386 2.541812 -0.843639
N  0.289449 -1.158907 0.368961
C  -1.82246 0.048085 0.029815
C  -0.330937 -0.002012 0.031755
C  -2.630563 -0.642353 0.991636
C  2.515838 -0.088686 -0.041046
C  1.67427 -1.21284 0.337631
C  1.823273 1.137063 -0.383939
C  0.423658 1.164024 -0.342381
C  -2.46805 0.817595 -0.977765
C  -4.03915 -0.52335 0.893398
C  -4.684846 0.23043 -0.118002
C  -3.870162 0.907471 -1.058615
C  -2.04949 -1.468547 2.125559
C  3.937644 -0.267764 -0.042784
C  2.280271 -2.460981 0.69539
C  -6.199486 0.291858 -0.200826
C  4.496391 -1.49988 0.312596
C  3.668171 -2.604593 0.683854
C  2.557434 2.3792 -0.77001
H  -0.095562 2.096584 -0.56917
H  -1.860209 1.330731 -1.731834
H  -4.655318 -1.039853 1.641056
H  -4.333836 1.500387 -1.855871
H  -1.23574 -0.935264 2.648888
H  -2.833445 -1.720778 2.861118
H  -1.601055 -2.401304 1.743895
H  4.575926 0.572125 -0.324301
H  1.611398 -3.282312 0.969344
H  -6.661961 0.276088 0.802098
H  -6.539875 1.203823 -0.721795
H  -6.601378 -0.576101 -0.759455
H  5.585362 -1.620429 0.305299
H  4.126641 -3.561192 0.957081
H  2.23224 4.233717 -1.318072
