program: Gaussian 09
title: 000230601
version: EM64L-G09RevD.01
frameworkgroup: C1[X(C17H20N2O2)]
method: RPBEPBE
basis: SDD
operation: Freq
keyword: #p
keyword: freq=noraman
keyword: PBEPBE/SDD
title: #p freq=noraman PBEPBE/SDD
converged: YES YES NO NO
title: Mulliken charges:
elementType: O O N N C C C C C C C C C C C C C C C C C H H H H H H H H H H H H H H H H H H H H
charge: -0.295784 -0.263922 -0.154002 -0.098243 -0.403850 -0.371724 -0.377947 -0.389890 -0.408299 0.210424 -0.427684 0.184373 0.260528 -0.089120 -0.366977 -0.330742 0.189765 -0.265640 -0.230035 -0.256728 -0.664985 0.222240 0.189964 0.199367 0.210509 0.213713 0.200321 0.210309 0.210041 0.280024 0.198636 0.261847 0.293538 0.255214 0.226000 0.226271 0.220855 0.235789 0.217879 0.252955 0.225008
chargesum: 0.00000
title: Mulliken charges with hydrogens summed into heavy atoms:
elementType: O O N N C C C C C C C C C C C C C C C C C
charge: -0.295784 -0.263922 -0.154002 -0.098243 0.008354 0.038153 0.036086 0.030459 0.070361 0.210424 -0.165836 0.184373 0.260528 -0.089120 -0.073438 -0.075527 0.189765 -0.039641 -0.003764 0.199916 0.030857
polarizability: 2.84869647e+02 3.44263800e+01 2.73914214e+02 -1.29899241e+01 -1.56067887e+00 1.15544428e+02
1716.lowfreq: -9.3235 -7.9396 -0.0003 0.0006 0.0006 3.1456 11.5646 13.8506 27.3266
frequency: 9.5361 13.1785 27.1793 52.0221 75.8500 81.0408 98.9597 135.7744 148.0553 183.4141 207.2391 217.9808 247.3817 270.1515 278.3373 306.2750 328.3340 367.1821 377.8790 394.3828 413.1162 434.5585 442.9547 468.1897 513.8847 526.6923 543.1783 559.7466 591.0936 623.6384 669.1994 687.7962 728.8064 742.3540 779.3317 784.6769 785.3823 801.6999 811.2332 823.4247 843.3247 852.6420 862.3624 883.3887 897.0803 901.8530 945.7126 950.6939 975.4155 975.7734 998.3552 1015.1419 1022.3066 1029.0949 1048.4838 1085.4499 1093.6369 1102.9902 1121.1410 1136.0920 1150.9564 1151.3631 1153.6018 1177.5645 1214.1956 1226.1482 1251.2084 1253.6826 1274.2008 1277.4394 1280.3539 1320.0781 1326.4638 1332.5369 1341.0413 1342.4429 1343.5449 1355.8590 1359.2622 1389.9198 1391.1183 1411.0839 1421.4351 1454.8246 1455.3270 1460.8227 1462.3984 1462.5877 1468.2982 1472.9392 1484.2684 1485.5471 1503.8521 1540.2972 1586.7326 1616.7400 1618.8406 2943.5761 2946.6907 2965.7823 2984.5783 2987.6168 2993.4150 3030.1981 3034.9576 3046.1002 3054.8852 3087.9355 3093.4456 3096.5332 3100.4094 3118.7779 3127.6904 3147.2110 3165.4575 3185.6657 3203.0201
redmass: 3.6931 4.3529 3.2479 3.7721 4.4630 4.5177 3.1541 5.2673 2.5742 4.0346 1.7425 1.8130 2.2719 4.2668 4.4688 3.4266 3.5427 6.0204 3.5724 2.0871 3.0348 3.1572 3.1809 2.9031 4.0479 5.7320 3.0396 3.1638 5.4755 5.0081 3.4522 4.4787 5.5366 4.0963 1.4991 2.6938 2.7518 1.5215 2.5620 2.2464 1.4687 3.8509 4.0547 1.5100 2.1882 1.8421 1.3282 4.0122 1.6201 2.2363 1.3059 2.8022 3.0343 2.1215 2.0594 1.4524 2.2444 2.5902 2.5911 2.3211 1.5476 1.3130 1.5952 1.3195 2.5337 1.6153 1.6208 1.2749 1.2008 1.4351 1.2239 2.4158 1.3242 1.8316 2.1769 1.5076 1.4946 1.2964 1.4612 2.7478 1.5331 3.1081 2.7422 1.1009 1.1040 1.1817 1.0498 1.1172 1.0933 1.4698 1.0980 1.5468 4.0914 6.8976 7.6719 6.3515 9.2224 1.0713 1.0707 1.0637 1.0608 1.0612 1.0362 1.0591 1.0961 1.1030 1.1033 1.0977 1.1033 1.0922 1.0903 1.1057 1.0861 1.0913 1.0974 1.0952 1.0898
irintensity: 0.2440 0.7113 0.0514 1.0223 0.2547 1.6270 0.2777 0.1195 0.1637 4.7619 0.4052 3.0304 2.9872 0.2603 1.6026 1.6003 16.8480 3.7744 1.0075 2.2524 6.0171 1.2325 2.5557 0.4092 9.6085 3.9334 0.8731 0.1717 6.8718 5.7862 1.1286 5.3506 0.1429 2.9769 89.5995 6.4765 14.5958 0.2917 2.4063 0.3484 17.3234 13.2172 6.9610 0.0618 5.6912 11.3770 2.9644 46.1413 12.7303 30.4980 0.5716 59.3908 83.5001 17.5079 26.8424 10.9328 88.0040 92.6515 10.5621 167.2709 43.2840 5.2749 12.2622 38.1631 30.1957 143.7320 105.5562 4.7849 18.3724 43.1479 14.7024 21.4503 6.0143 9.9535 14.3668 13.7421 1.3501 2.4160 7.9890 48.7896 14.6259 3.4056 98.9971 12.7300 13.5434 49.4142 19.4647 14.3441 10.2782 31.5507 4.2938 41.7122 74.1518 184.3255 502.9322 29.0910 17.2877 25.1692 123.2798 52.6072 33.5357 30.8270 22.2724 35.8961 74.8949 32.6160 101.2577 37.9026 2.7292 11.0338 19.3667 28.5459 7.9627 21.5586 21.7712 16.9969 0.8960
temp: 298.150 k
press: 1.00000 atm
elementType: 8 8 7 7 6 6 6 6 6 6 6 6 6 6 6 6 6 6 6 6 6 1 1 1 1 1 1 1 1 1 1 1 1 1 1 1 1 1 1 1 1
symmnumber: 1
zpe: 887778.5 jmol-1
zpe.correction: 0.338137 hartree
zpe.thermalcorrener: 0.357268 hartree
zpe.thermalcorrenthalpy: 0.358212 hartree
zpe.thermalcorrgfe: 0.287120 hartree
zpe.sumelectzpe: -918.240833 hartree
zpe.sumelectthermal: -918.221702 hartree
zpe.sumelectthermalent: -918.220758 hartree
zpe.sumelectthermalfe: -918.291850 hartree
dipole: -2.4785 -3.6216 0.1262
dipole: 4.3904
quadrupole: -114.6565 -108.4459 -126.7347
quadrupole: -1.7455 -0.3552 -0.3382
quadrupole: 1.9559 8.1664 -10.1223 -1.7455 -0.3552 -0.3382
hfenergy: -918.5789697 hartree
pointgroup: C01 [X(C17H20N2O2)]
dipole: -1.0727471 1.3283022 -0.2615323 debye
polarizability: 289.2276751|-30.6543311|265.5626119|20.4547686|-23.035542|119.5380027 unknown
InChI: InChI=1S/C17H20N2O2/c1-2-21-17(20)14-12-16(19-10-6-3-7-11-19)18-15-9-5-4-8-13(14)15/h4-5,8-9,12H,2-3,6-7,10-11H2,1H3
charge 0 multiplicity 1
41 atoms
O  1.883329 2.570681 -0.147132
O  3.593167 1.04781 0.244869
N  -2.419251 0.150123 -0.650666
N  -0.904613 -1.588409 -0.190552
C  -5.112382 0.918776 0.209273
C  -3.928905 1.914106 0.258531
C  -4.603222 -0.536843 0.333616
C  -2.860303 1.549169 -0.803795
C  -3.521436 -0.835663 -0.730331
C  -1.115286 -0.259138 -0.376819
C  -0.022498 0.68295 -0.299745
C  1.275968 0.245505 -0.023646
C  1.531092 -1.16872 0.183719
C  0.372038 -2.04065 0.07903
C  2.806617 -1.750483 0.475644
C  0.539824 -3.451536 0.267541
C  2.372472 1.268151 0.042227
C  2.936238 -3.132584 0.655175
C  1.797362 -3.988875 0.550104
C  2.899967 3.665481 -0.131188
C  3.526137 3.847684 -1.51687
H  -5.840112 1.146953 1.010575
H  -5.649068 1.037324 -0.755436
H  -4.280949 2.948498 0.078921
H  -3.461349 1.889899 1.26218
H  -4.170555 -0.699422 1.339828
H  -5.439378 -1.252167 0.213155
H  -3.302501 1.672688 -1.816595
H  -2.006913 2.239233 -0.735949
H  -3.082707 -1.835365 -0.596395
H  -3.974407 -0.777602 -1.744011
H  -0.175659 1.750001 -0.456188
H  3.677582 -1.096885 0.553699
H  -0.352404 -4.079179 0.181247
H  3.919802 -3.560711 0.877646
H  1.91287 -5.069499 0.692351
H  2.321405 4.549486 0.182049
H  3.666237 3.421959 0.625328
H  4.210294 4.716556 -1.504433
H  4.107862 2.956026 -1.803748
H  2.750237 4.03047 -2.280307
