program: Gaussian 09
title: 000230586
version: EM64L-G09RevD.01
frameworkgroup: C1[X(C12H10ClNO2)]
method: RPBEPBE
basis: SDD
operation: Freq
keyword: #p
keyword: freq=noraman
keyword: PBEPBE/SDD
title: #p freq=noraman PBEPBE/SDD
converged: YES YES NO NO
title: Mulliken charges:
elementType: Cl O O N C C C C C C C C C C C C H H H H H H H H H H
charge: -0.030278 -0.285843 -0.258492 0.075785 0.284314 0.173208 -0.084871 -0.361252 -0.203830 -0.305736 0.205746 -0.243803 -0.220774 -0.333934 -0.256452 -0.662619 0.301302 0.297187 0.270160 0.234621 0.238001 0.228182 0.237244 0.222197 0.249724 0.230214
chargesum: 0.00000
title: Mulliken charges with hydrogens summed into heavy atoms:
elementType: Cl O O N C C C C C C C C C C C C
charge: -0.030278 -0.285843 -0.258492 0.075785 0.284314 0.173208 -0.084871 -0.059950 0.093357 -0.035576 0.205746 -0.009182 0.017226 -0.333934 0.208974 0.039515
polarizability: 1.98716710e+02 -1.91674669e+01 2.11258476e+02 5.27147567e+00 -6.66187162e-01 6.94100757e+01
1716.lowfreq: -6.7845 -4.2712 -0.0030 -0.0023 -0.0022 2.4743 22.1841 51.1176 72.8600
frequency: 22.1280 51.1083 72.8526 88.0899 121.9608 135.3913 184.7243 196.3322 225.0468 274.3359 287.7435 319.1470 341.0593 367.4744 408.9946 435.2785 487.0402 515.8858 527.8081 554.0481 590.6671 651.1336 672.0746 723.6849 737.1208 782.4927 786.3485 793.6538 821.4156 833.2064 865.7054 896.3431 918.1087 964.1136 985.1438 1010.1614 1017.1952 1027.8250 1087.6541 1096.4724 1131.9384 1151.5988 1156.0231 1182.4693 1235.7438 1267.9841 1280.2967 1287.0337 1347.9778 1357.1980 1379.2638 1394.1768 1412.5007 1451.6267 1456.7425 1465.0248 1484.1111 1500.3761 1542.7238 1562.9856 1615.3190 1618.5091 2994.9593 3033.6300 3090.3121 3096.4149 3122.2479 3137.6107 3155.0411 3175.7044 3188.6334 3209.9610
redmass: 4.7722 3.6525 4.4684 5.6862 3.9075 4.9832 4.4332 3.4459 1.5293 5.4231 5.5089 3.4814 10.3228 9.2808 3.7553 3.4433 6.1869 3.5328 6.1107 7.4697 7.0505 4.3495 6.1260 4.8396 4.1689 2.3979 1.6303 2.9723 1.7166 5.8976 5.4070 1.5045 1.4513 4.0728 1.3530 1.3212 3.2906 2.2703 2.6273 2.1641 3.7187 1.3903 1.6602 1.3065 1.9535 2.3022 1.1312 3.2201 3.0508 1.4002 3.9122 1.2301 3.0443 2.8724 1.1396 1.0426 1.0532 3.8953 8.9632 7.5834 8.8790 6.5846 1.0362 1.0596 1.0973 1.1032 1.1064 1.0869 1.0919 1.0975 1.0958 1.0934
irintensity: 1.1565 0.7949 0.1390 0.7817 0.8053 0.8763 6.2858 1.6205 2.5501 0.6306 1.7607 11.2793 17.1839 2.6074 4.6195 1.4215 5.7588 1.8838 10.5560 3.5816 21.2106 0.0416 21.4605 0.0294 0.9275 4.5949 72.5531 26.1117 1.5473 18.3770 48.2491 0.1952 15.2955 27.3419 4.1066 0.5806 119.4852 8.1397 32.4008 32.8710 385.3096 21.1229 38.2063 35.5038 153.1544 48.1083 2.5818 7.0725 26.6590 6.1361 6.5928 23.1171 5.6703 11.5420 18.2782 15.6654 14.7915 56.7165 146.9897 29.5509 70.8238 1.4177 18.6261 31.2619 35.5422 1.0269 26.4447 7.2385 14.7296 9.2640 17.3037 3.8619
temp: 298.150 k
press: 1.00000 atm
elementType: 17 8 8 7 6 6 6 6 6 6 6 6 6 6 6 6 1 1 1 1 1 1 1 1 1 1
symmnumber: 1
zpe: 504603.4 jmol-1
zpe.correction: 0.192193 hartree
zpe.thermalcorrener: 0.206380 hartree
zpe.thermalcorrenthalpy: 0.207324 hartree
zpe.thermalcorrgfe: 0.149347 hartree
zpe.sumelectzpe: -1127.415140 hartree
zpe.sumelectthermal: -1127.400954 hartree
zpe.sumelectthermalent: -1127.400009 hartree
zpe.sumelectthermalfe: -1127.457987 hartree
dipole: -2.6042 -2.1653 -0.0473
dipole: 3.3871
quadrupole: -82.5306 -102.3560 -101.1339
quadrupole: -13.1736 0.7228 -0.4990
quadrupole: 12.8096 -7.0159 -5.7938 -13.1736 0.7228 -0.4990
hfenergy: -1127.6073335 hartree
pointgroup: C01 [X(C12H10Cl1N1O2)]
dipole: 1.0628433 -0.8010454 0.0669051 debye
dipolederiv: -0.132941 0.1539712 -0.0181043 0.061767 -1.0684963 0.1133099 -0.0083423 0.1229338 -0.1058209 -1.7041666 -0.2953943 0.100026 -0.6002523 -0.5963399 0.0174598 -0.0080995 -0.0142448 -0.3249842 -0.7983095 0.1752159 -0.0178571 -0.0789944 -0.8035714 0.0580046 -0.0147888 0.0464136 -0.3087372 -0.3968304 -0.3898351 0.0421079 0.1521319 -0.6437679 0.0587078 -0.0253997 0.0432687 -0.1743571 -0.2937775 -0.2423854 0.0208617 0.3422666 -0.0238727 0.010437 -0.0480986 -0.0008206 0.0517997 -0.3672286 0.2457595 -0.0306022 0.2540314 0.2250534 -0.0222339 -0.0392067 -0.0209805 0.0073783 0.2221451 0.4103197 -0.0443935 -0.0456652 0.1972237 -0.0180558 0.0090145 -0.0035884 0.0643427 -0.0624088 -0.0770285 0.0134764 -0.1287095 -0.0474947 -0.0105457 0.0175805 -0.0105216 -0.13036 -0.0316133 0.2775724 -0.0266749 -0.1082021 -0.5766577 0.0614908 0.0047434 0.0802613 -0.0415932 0.0949088 -0.0647721 0.0158938 -0.0776214 -0.1036575 -0.0086999 0.018144 -0.0076982 -0.1571907 2.0280989 0.0360409 0.0156023 0.5318256 1.1023831 -0.0960796 0.0577491 -0.0553025 0.2291204 -0.0589389 -0.1303957 0.0179099 -0.0738264 0.1564624 -0.039255 0.0117529 -0.0392445 -0.1407631 0.1650857 0.1377873 -0.006886 0.0787088 -0.0645432 -0.0061225 0.0007709 -0.0041002 -0.1368691 0.2022006 -0.2276859 0.0319732 -0.2326219 1.802534 -0.2115925 0.0347214 -0.2242763 0.0313482 1.0436063 0.1008115 -0.0877161 -0.0727652 0.2309786 0.0153753 -0.0046141 0.0525207 0.3355176 -0.1409602 -0.0198135 0.0573692 0.0409592 0.0371575 -0.0338264 0.0332152 -0.0653036 -0.1137716 0.1273119 0.0850919 -0.014466 0.0468267 0.095393 0.007503 -0.0091858 0.0088195 0.1611194 0.1121181 -0.0347289 0.0011263 -0.0737378 0.0923404 0.0089467 0.0094901 0.0057758 0.1529189 -0.0152748 0.0245481 -0.0083721 0.0786224 0.0762344 0.0128024 -0.0155373 0.0112272 0.1608418 0.0845799 0.017047 -0.0041473 0.0016764 -0.1162528 0.0334337 -0.0027177 0.0326282 0.1517681 -0.0543893 -0.1059831 0.006451 -0.1067526 0.0175494 0.0139911 0.0057899 0.0132341 0.1580622 -0.0460321 -0.0417038 -0.0100648 -0.0766288 -0.0379576 -0.114265 -0.0230406 -0.0769228 0.0277545 -0.0124281 -0.0285657 0.0322249 0.0978553 0.008301 0.1120232 -0.0018079 0.0596155 -0.0160207 -0.1920486 0.027874 -0.0025468 0.0461453 0.1182748 0.0002453 0.0224902 0.0127808 0.0854699 0.1010619 -0.0879737 -0.0519996 -0.0776909 -0.0329358 -0.0797753 -0.0295278 -0.042635 0.0438863 0.1262306 0.0542264 -0.031192 0.020652 -0.044338 0.116721 0.0049048 0.0761597 -0.0108602 unknown
polarizability: 197.1815851|18.4007658|211.1603977|-2.1462942|-16.1964984|71.0432787 unknown
InChI: InChI=1S/C12H10ClNO2/c1-2-16-12(15)9-7-11(13)14-10-6-4-3-5-8(9)10/h3-7H,2H2,1H3
charge 0 multiplicity 1
26 atoms
Cl -1.404376 3.734702 -0.538637
O  2.752304 0.694298 0.05312
O  2.227542 -1.568423 0.148703
N  -2.215763 1.165623 -0.259426
C  -0.699444 -0.795266 0.024965
C  0.432495 0.110362 -0.041757
C  -2.023079 -0.201022 -0.089305
C  -0.611571 -2.215773 0.198171
C  0.201981 1.484125 -0.212063
C  -3.189667 -1.023933 -0.028319
C  1.852739 -0.372103 0.060315
C  -1.770696 -2.996375 0.254681
C  -3.066548 -2.404095 0.141862
C  -1.145114 1.934969 -0.313641
C  4.206337 0.343711 0.120776
C  4.763054 0.07193 -1.27896
H  0.374941 -2.675596 0.281673
H  1.035532 2.184332 -0.264406
H  -4.161243 -0.529939 -0.118994
H  -1.683279 -4.080245 0.387302
H  -3.96064 -3.03485 0.189062
H  4.660689 1.233827 0.583875
H  4.322999 -0.533987 0.779935
H  5.85412 -0.096147 -1.215401
H  4.302774 -0.828162 -1.719471
H  4.58571 0.930834 -1.948663
