program: Gaussian 09
title: 000230578
version: EM64L-G09RevD.01
frameworkgroup: C1[X(C11H12N4O3S)]
method: RPBEPBE
basis: SDD
operation: Freq
keyword: #p
keyword: freq=noraman
keyword: PBEPBE/SDD
title: #p freq=noraman PBEPBE/SDD
converged: NO YES NO NO
title: Mulliken charges:
elementType: S O O O N N N N C C C C C C C C C C C H H H H H H H H H H H H
charge: 0.950226 -0.535528 -0.533065 -0.253772 -0.298123 -0.078016 0.047472 -0.716995 0.442241 0.362501 -0.229293 0.182953 -0.059295 -0.325541 -0.347476 -0.229602 -0.213208 -0.768833 -0.746142 0.270342 0.294840 0.287031 0.288174 0.247424 0.250404 0.292365 0.249545 0.240785 0.250847 0.339248 0.338493
chargesum: 0.00000
title: Mulliken charges with hydrogens summed into heavy atoms:
elementType: S O O O N N N N C C C C C C C C C C C
charge: 0.950226 -0.535528 -0.533065 -0.253772 -0.298123 -0.078016 0.047472 -0.039254 0.442241 0.362501 -0.229293 0.182953 -0.059295 -0.055200 -0.052637 0.057429 0.074966 0.021360 -0.004966
polarizability: 3.17541843e+02 1.04321995e+01 1.82750337e+02 3.01717621e+00 -8.62977338e+00 1.07543917e+02
1716.lowfreq: -4.6775 0.0007 0.0009 0.0011 1.6865 4.9001 22.3545 37.5659 47.9499
frequency: 22.1642 37.5592 47.9411 62.3267 83.3825 100.8042 116.4697 120.7092 155.1789 164.2037 176.6727 178.8227 188.2482 224.5566 264.6763 269.8223 286.3496 294.8254 304.6810 339.6417 350.6205 370.2172 410.9630 417.6779 443.5750 472.0209 490.9715 527.0321 559.4484 606.4130 615.0018 645.4656 692.2938 698.7475 720.2260 736.0547 794.8903 805.3225 834.4957 841.1725 853.2416 908.8026 964.8012 968.4359 983.2356 993.6780 1016.8941 1026.9103 1036.9724 1046.6151 1056.7218 1059.1546 1072.1934 1123.9828 1178.7780 1187.2698 1273.9301 1294.5266 1298.4983 1379.5983 1390.7235 1398.9056 1402.5426 1407.9957 1422.6283 1440.2786 1453.3573 1456.7740 1473.4484 1478.7623 1498.0731 1518.7576 1534.9525 1596.3998 1598.1375 2985.0183 3000.8255 3067.6047 3083.5064 3113.4168 3117.7171 3160.5968 3161.7372 3188.5167 3193.6850 3368.7002 3536.3248
redmass: 6.2226 6.9234 3.4695 6.4886 1.0433 5.2028 1.5187 4.7424 5.2482 4.5374 1.9997 5.1620 4.7332 2.7267 2.9495 4.5619 3.4914 5.4825 3.7190 7.1374 5.7159 5.2020 3.6689 4.2868 7.5271 4.4318 5.3011 3.8447 3.8618 4.4238 7.0038 6.7673 6.3362 4.7271 6.0106 4.2414 2.1899 4.2422 4.0367 1.2665 1.5462 4.0444 2.4723 1.3517 1.3823 4.5050 2.9092 2.2924 1.5850 1.5479 2.5233 3.0559 1.4989 1.3103 2.2568 1.5720 4.6855 3.7350 1.7573 4.3930 8.4657 1.3160 2.4179 1.3885 2.6317 1.4475 1.6130 1.1683 1.7668 1.2009 3.2906 3.8817 1.0848 6.2098 7.9086 1.0407 1.0367 1.0924 1.0971 1.0998 1.1005 1.0905 1.0910 1.0949 1.0956 1.0414 1.1004
irintensity: 0.2120 1.9761 3.4050 0.8637 1.2833 2.4906 37.5653 1.1896 4.0576 3.0367 2.6480 1.9042 2.4668 3.5215 3.8429 1.7945 1.3904 5.0691 0.9509 34.0944 13.0920 11.3333 1.4454 8.9209 33.0062 117.0590 54.7490 49.0556 35.6543 3.1636 0.2117 6.5853 10.1384 1.4624 22.1731 5.0596 44.7358 212.0046 29.3849 5.0822 56.1268 58.5745 1.6809 0.1082 1.8183 7.9618 10.3306 5.5232 1.9515 5.9088 70.2557 43.5986 31.1244 6.1673 10.5090 1.0291 34.9571 308.2464 77.3515 84.3979 30.3304 46.1436 6.6683 29.5001 92.7734 10.1016 5.1937 19.6602 98.9695 7.2492 38.0674 88.7873 22.9138 37.7988 4.1729 7.0977 9.8630 7.2857 8.0676 1.6921 8.2479 2.0209 2.2890 3.8426 1.5438 34.8933 27.4027
temp: 298.150 k
press: 1.00000 atm
elementType: 16 8 8 8 7 7 7 7 6 6 6 6 6 6 6 6 6 6 6 1 1 1 1 1 1 1 1 1 1 1 1
symmnumber: 1
zpe: 581655.9 jmol-1
zpe.correction: 0.221541 hartree
zpe.thermalcorrener: 0.241082 hartree
zpe.thermalcorrenthalpy: 0.242026 hartree
zpe.thermalcorrgfe: 0.172303 hartree
zpe.sumelectzpe: -1267.465035 hartree
zpe.sumelectthermal: -1267.445494 hartree
zpe.sumelectthermalent: -1267.444550 hartree
zpe.sumelectthermalfe: -1267.514273 hartree
dipole: 1.3021 1.5422 2.6253
dipole: 3.3115
quadrupole: -152.2206 -115.1412 -119.5341
quadrupole: -2.7100 16.2167 -2.7425
quadrupole: -23.2553 13.8241 9.4312 -2.7100 16.2167 -2.7425
hfenergy: -1267.6865757 hartree
pointgroup: C01 [X(C11H12N4O3S1)]
dipole: 0.4944375 -0.6175918 -1.0351484 debye
polarizability: 317.2764692|-11.4947115|182.7727384|-5.7772769|-8.9933396|107.78689 unknown
InChI: InChI=1S/C11H12N4O3S/c1-7-11(14-16)8(2)15(13-7)9-3-5-10(6-4-9)19(12,17)18/h3-6H,12H2,1-2H3
charge 0 multiplicity 1
31 atoms
S  4.696693 0.066159 0.048494
O  5.114602 1.639024 -0.02068
O  5.193763 -0.95514 1.215331
O  -5.075277 1.859785 0.189351
N  -1.381734 -0.193777 -0.047376
N  -1.952277 -1.503515 -0.1703
N  -4.923958 0.572213 0.095592
N  5.202781 -0.675238 -1.557272
C  0.047082 -0.11073 -0.03924
C  -2.33824 0.795714 0.078685
C  -3.589769 0.109722 0.008066
C  -3.287034 -1.299267 -0.141316
C  2.819512 -0.018229 -0.009604
C  0.715993 1.023668 -0.564549
C  0.779607 -1.206822 0.48429
C  2.124536 1.076351 -0.544031
C  2.186308 -1.161886 0.503414
C  -2.082044 2.248458 0.338495
C  -4.252458 -2.438529 -0.262406
H  0.154955 1.844895 -1.015581
H  0.236275 -2.076366 0.859724
H  2.667145 1.947444 -0.92382
H  2.775709 -1.979432 0.929805
H  -1.135425 2.414497 0.879593
H  -2.054096 2.830822 -0.602734
H  -2.926135 2.654262 0.917547
H  -4.888755 -2.318743 -1.156808
H  -3.707918 -3.39337 -0.333792
H  -4.930273 -2.468395 0.60844
H  5.73564 0.036359 -2.084475
H  5.746188 -1.532129 -1.360843
