program: Gaussian 09
title: 000230573
version: EM64L-G09RevD.01
frameworkgroup: C1[X(C8H11NOS)]
method: RPBEPBE
basis: SDD
operation: Freq
keyword: #p
keyword: freq=noraman
keyword: PBEPBE/SDD
title: #p freq=noraman PBEPBE/SDD
converged: YES YES NO NO
title: Mulliken charges:
elementType: S O N C C C C C C C C H H H H H H H H H H H
charge: 0.122569 -0.448876 -0.709771 -0.349563 0.520569 -0.657087 -0.235289 -0.396656 -0.285034 -0.268551 -0.203279 0.289798 0.268809 0.246680 0.213457 0.212875 0.234666 0.227850 0.221879 0.345530 0.298261 0.351164
chargesum: 0.00000
title: Mulliken charges with hydrogens summed into heavy atoms:
elementType: S O N C C C C C C C C
charge: 0.122569 -0.097712 -0.065981 -0.349563 0.520569 -0.098480 0.011391 -0.183200 0.162507 -0.040700 0.018600
polarizability: 1.63271565e+02 1.43777596e+00 1.14565862e+02 9.88248249e-01 2.20605171e+00 6.72133544e+01
1716.lowfreq: -8.0829 -6.8615 -0.0018 0.0012 0.0016 9.9004 61.7255 99.3216 108.8395
frequency: 61.7202 99.3105 108.8197 164.8649 186.6266 226.3872 265.6313 282.0504 360.3831 433.1953 449.0679 454.2844 462.1414 510.3266 542.4740 553.1564 614.6379 655.6742 722.0000 738.5393 758.2986 811.6588 828.5824 845.3387 909.5201 936.8442 967.8593 1003.6290 1005.5663 1019.7514 1040.9573 1048.7150 1138.3851 1149.4664 1170.6359 1174.3092 1266.7790 1273.2995 1322.1824 1338.6890 1366.1009 1382.0005 1436.5131 1441.6753 1465.1147 1485.6251 1566.5936 1612.2790 1663.7744 2984.2297 3038.1573 3079.6992 3113.6714 3118.7462 3135.5302 3144.1194 3168.6772 3393.5686 3457.7781 3638.0838
redmass: 5.9021 3.1919 4.8590 3.6555 4.4908 2.8052 5.2753 4.7061 4.0055 1.5036 2.0142 1.8854 2.8557 1.8497 4.1364 5.0850 3.8801 6.4665 2.7109 1.2351 1.2234 1.7563 4.7855 1.5112 2.4032 1.3621 1.3143 3.3134 1.5175 3.2158 2.0933 1.8849 1.3202 1.1072 1.0581 1.3297 1.5974 1.2340 1.9246 1.1952 1.1923 6.2331 1.8616 1.3242 1.0812 3.1075 6.3344 5.7560 1.1766 1.0659 1.0586 1.0985 1.0869 1.1077 1.0883 1.0938 1.1002 1.0616 1.0636 1.0909
irintensity: 0.6435 1.9343 11.9764 12.4175 3.2758 0.3515 2.9275 5.9655 19.4761 67.4891 20.5254 149.9280 54.3672 173.5862 2.1256 6.1405 14.7710 6.4819 10.9921 161.4144 22.6005 8.0653 4.8449 2.7287 35.8324 2.5781 0.2002 16.6056 5.6628 46.4774 3.6472 13.8563 9.2754 14.0651 4.8366 4.6172 2.7659 15.1747 15.3710 16.7241 14.4289 20.8700 8.9905 8.8222 3.7659 89.5958 4.4404 58.5938 162.5516 67.7121 17.4032 22.1583 11.9433 10.1023 6.2960 24.9142 24.2934 308.5150 52.0920 46.9573
temp: 298.150 k
press: 1.00000 atm
elementType: 16 8 7 6 6 6 6 6 6 6 6 1 1 1 1 1 1 1 1 1 1 1
symmnumber: 1
zpe: 464113.4 jmol-1
zpe.correction: 0.176771 hartree
zpe.thermalcorrener: 0.187775 hartree
zpe.thermalcorrenthalpy: 0.188719 hartree
zpe.thermalcorrgfe: 0.140097 hartree
zpe.sumelectzpe: -838.649528 hartree
zpe.sumelectthermal: -838.638525 hartree
zpe.sumelectthermalent: -838.637581 hartree
zpe.sumelectthermalfe: -838.686203 hartree
dipole: 0.8684 0.4655 1.3472
dipole: 1.6690
quadrupole: -67.9489 -68.6648 -74.9334
quadrupole: -5.3600 2.2561 -0.3850
quadrupole: 2.5668 1.8509 -4.4177 -5.3600 2.2561 -0.3850
hfenergy: -838.8262997 hartree
pointgroup: C01 [X(C8H11N1O1S1)]
dipole: 0.3374223 -0.0420724 -0.5617423 debye
dipolederiv: -0.292531 0.0741757 -0.0115107 0.1520044 -0.1135115 0.055265 0.038324 0.0409769 0.0092193 -0.9082715 0.0741974 -0.090416 0.0715146 -0.6280726 0.2180852 -0.0537956 0.2180324 -0.3237754 -0.8852208 0.5894351 0.1594422 0.5055819 -0.8358055 0.0425991 0.1686096 0.0499019 -0.5883379 0.3668752 0.0183375 0.0998883 0.4709857 -0.2501841 0.003269 0.2003518 -0.0646851 -0.2117926 0.4308656 -0.779635 -0.2050651 -0.5964928 0.7254838 0.090048 -0.2579622 0.070993 0.1268252 0.0550482 0.0250757 -0.1826584 -0.0679143 0.0183714 0.0330232 -0.2098926 -0.0257958 0.0817267 0.1627396 0.0766981 0.0676326 -0.2643725 0.0357373 0.0306151 -0.0167514 0.0786829 -0.0722833 -0.2206178 0.4166707 0.1446445 -0.0765423 -0.0627984 0.0539913 -0.0218978 0.1326272 -0.1842808 0.4240378 0.0384615 0.0107857 0.0911443 0.4443957 -0.0825223 0.0953331 -0.1372273 0.2590349 -0.2765359 -0.1450863 -0.0402141 -0.1199381 -0.1928608 0.007818 -0.0363823 -0.0115303 -0.2310686 0.0851374 -0.0924385 0.01878 0.1107216 0.2483631 0.1423228 0.0745551 0.1287301 -0.0670244 -0.0081519 0.0048599 -0.0369693 -0.0002135 0.05695 -0.0767014 -0.0333267 -0.030727 -0.0327491 -0.0207256 -0.0382278 0.0619379 -0.0502572 -0.073635 0.0748038 0.0981494 0.0698967 0.0324348 0.1024355 -0.0610516 -0.0373212 -0.0375515 -0.02894 -0.0636729 -0.0257159 -0.0718496 0.114071 0.0403732 -0.0098604 -0.0227998 -0.0559131 -0.0984428 -0.1045412 -0.0327435 -0.1064341 0.1213603 -0.0741257 -0.068224 -0.0646314 -0.1394696 -0.0452072 -0.0213496 -0.1407474 -0.0391742 -0.0015304 -0.0034903 0.0058757 0.0911263 0.1016844 0.0514368 -0.0636518 0.0999287 -0.0099177 -0.0541465 -0.0462861 0.1017535 0.005265 0.1116788 -0.0102105 -0.0541049 0.0034955 -0.0544006 0.1611171 -0.127989 -0.0390666 -0.0592351 -0.0458461 0.0927808 -0.0303467 -0.0684995 -0.0302681 0.1298225 0.5870787 -0.0147659 -0.0028577 0.0390231 0.1920523 -0.0502184 0.0496454 -0.0622681 0.2723216 0.1285221 -0.0457194 -0.0441624 -0.0427495 0.2012395 -0.0631366 -0.0510619 -0.0650474 0.3168509 0.4808322 -0.1314653 0.1383387 -0.1570782 0.2728577 -0.1415948 0.1203843 -0.0805158 0.1422049 unknown
polarizability: 162.4634528|-6.6400362|109.3426824|0.0039541|16.0194034|73.2446463 unknown
InChI: InChI=1S/C8H11NOS/c9-7-3-1-2-4-8(7)11-6-5-10/h1-4,10H,5-6,9H2
charge 0 multiplicity 1
22 atoms
S  1.316056 1.090328 0.994587
O  3.138342 -1.269147 0.226004
N  0.209004 -1.610942 -0.338364
C  -0.390354 0.674633 0.42093
C  -0.728941 -0.60932 -0.12247
C  2.32698 0.936297 -0.629096
C  -1.385837 1.660152 0.612107
C  -2.101577 -0.839537 -0.456928
C  3.534579 0.010264 -0.393058
C  -2.736601 1.407936 0.288977
C  -3.083361 0.144949 -0.249372
H  1.640535 0.529815 -1.388427
H  2.646146 1.948309 -0.927947
H  -1.087039 2.631886 1.019809
H  -2.382473 -1.814178 -0.876026
H  4.296148 0.513682 0.236508
H  4.001476 -0.264261 -1.353878
H  -3.496185 2.179471 0.447655
H  -4.125165 -0.072435 -0.512081
H  1.214411 -1.496935 -0.159754
H  -0.103476 -2.503818 -0.71174
H  2.790332 -1.048846 1.134764
