program: Gaussian 09
title: 000230568
version: EM64L-G09RevD.01
frameworkgroup: C1[X(C11H19NO2)]
method: RPBEPBE
basis: SDD
operation: Freq
keyword: #p
keyword: freq=noraman
keyword: PBEPBE/SDD
title: #p freq=noraman PBEPBE/SDD
converged: NO YES NO NO
title: Mulliken charges:
elementType: O O N C C C C C C C C C C C H H H H H H H H H H H H H H H H H H H
charge: -0.253421 -0.441704 -0.067213 -0.132986 -0.137817 -0.175596 -0.178532 -0.502030 -0.490389 -0.449351 -0.450997 -0.326190 -0.088202 -0.698965 0.244807 0.245467 0.247014 0.248171 0.237782 0.219955 0.216889 0.242298 0.235468 0.205049 0.205919 0.235927 0.182108 0.214827 0.217243 0.230163 0.187605 0.252818 0.323883
chargesum: 0.00000
title: Mulliken charges with hydrogens summed into heavy atoms:
elementType: O O N C C C C C C C C C C C
charge: -0.253421 -0.117820 -0.067213 0.111821 0.107650 0.071418 0.069639 -0.044294 -0.031202 -0.008835 -0.009151 0.070746 0.129042 -0.028379
polarizability: 1.48660477e+02 -1.99078579e+00 1.12116407e+02 -1.86835462e-01 -3.97402051e+00 1.08877807e+02
1716.lowfreq: -25.9012 -5.7987 -0.0011 -0.0006 -0.0002 12.1876 40.9674 53.5773 71.7338
frequency: 40.0427 53.3600 71.5499 113.0136 173.0540 193.4691 221.9053 241.7721 273.9749 287.9417 317.1117 373.4636 396.2041 410.7756 443.6844 463.7573 555.4810 561.4449 624.8181 671.1436 733.6955 767.9371 775.0562 819.0143 822.8514 841.3436 860.1837 875.5804 888.8349 903.8471 909.4749 921.2031 951.7214 954.8075 991.5187 993.4881 1005.2431 1015.3328 1025.3805 1035.4365 1050.9009 1067.3317 1069.4183 1119.1522 1139.2636 1154.7335 1172.6281 1183.2995 1192.1663 1196.6122 1210.3210 1240.4484 1243.3924 1249.8530 1259.0096 1263.0524 1275.7310 1277.8517 1282.3151 1312.0142 1317.9424 1318.7445 1331.7145 1334.5449 1359.1778 1369.1728 1378.5934 1454.1114 1456.5679 1460.7305 1465.8917 1472.2893 1473.8783 1476.1026 2896.4036 2968.2217 2990.3404 2999.6672 3001.8958 3012.5170 3023.8196 3026.2699 3039.3721 3040.5632 3070.2711 3071.9594 3074.5656 3080.4838 3094.0909 3094.3365 3099.5483 3102.7237 3547.8879
redmass: 3.7920 3.4733 3.8392 2.4812 3.0466 4.7583 1.6714 1.3141 2.4698 1.0890 2.5376 2.4691 2.7337 2.4251 2.7601 2.2655 4.0338 4.7069 4.0651 2.6297 4.7891 4.2547 2.8804 2.2574 1.9232 4.4410 2.5182 3.5071 3.3576 3.6359 1.5475 2.2200 2.2264 1.9064 2.3127 2.3078 2.1136 1.8192 1.8705 2.2324 1.8774 1.8213 2.0775 2.4191 1.2649 2.0392 1.7443 1.2886 1.2321 1.4709 1.3089 1.2451 1.5802 1.4909 1.3353 1.2692 1.3831 1.4346 1.4379 1.5459 1.3963 1.4656 1.2853 1.3182 1.4107 1.1669 1.2588 1.0814 1.0751 1.0831 1.0744 1.0798 1.0504 1.0971 1.0657 1.0402 1.0634 1.0695 1.0848 1.0596 1.0840 1.0630 1.0868 1.0869 1.0953 1.1042 1.1006 1.1026 1.0933 1.0988 1.1005 1.0958 1.0658
irintensity: 1.6714 1.6889 1.2856 1.4521 0.8911 4.0891 3.9309 4.6914 0.7266 98.7795 31.9174 4.0450 18.0768 7.7895 0.3127 11.1409 2.3576 7.0602 14.7202 1.4739 1.5628 17.9851 22.7494 2.0516 20.0248 9.0924 4.6224 10.1347 3.5335 0.4408 6.2399 10.3019 14.0829 32.7547 1.3141 3.4470 3.8510 59.0068 29.5749 25.9943 4.0487 10.1448 83.1948 1.9457 9.9667 11.9532 8.7429 7.2919 1.8223 7.3089 3.5461 2.9492 0.8514 10.9574 8.4099 2.3566 9.5587 15.2320 1.4612 10.6537 1.8293 3.7199 0.8724 1.6201 4.3199 16.6574 43.0334 11.9698 3.9372 2.8525 11.0056 5.6723 8.1054 12.0202 59.4656 25.9316 34.9570 35.1982 12.4573 24.9935 10.5707 40.4365 28.7233 33.4995 26.9146 1.9599 59.4869 29.1369 49.1633 48.2934 20.5911 27.1601 4.2974
temp: 298.150 k
press: 1.00000 atm
elementType: 8 8 7 6 6 6 6 6 6 6 6 6 6 6 1 1 1 1 1 1 1 1 1 1 1 1 1 1 1 1 1 1 1
symmnumber: 1
zpe: 756301.9 jmol-1
zpe.correction: 0.288060 hartree
zpe.thermalcorrener: 0.301255 hartree
zpe.thermalcorrenthalpy: 0.302199 hartree
zpe.thermalcorrgfe: 0.248075 hartree
zpe.sumelectzpe: -634.610841 hartree
zpe.sumelectthermal: -634.597646 hartree
zpe.sumelectthermalent: -634.596702 hartree
zpe.sumelectthermalfe: -634.650827 hartree
dipole: 1.0518 0.2392 -2.2639
dipole: 2.5078
quadrupole: -89.3422 -87.8286 -83.8198
quadrupole: -10.4330 -1.8216 -6.3516
quadrupole: -2.3453 -0.8318 3.1771 -10.4330 -1.8216 -6.3516
hfenergy: -634.8989013 hartree
pointgroup: C01 [X(C11H19N1O2)]
dipole: 0.4383601 0.8839035 -0.0010436 debye
polarizability: 148.5800523|-1.0368363|109.7352007|-2.3258301|4.2836464|111.3394384 unknown
InChI: InChI=1S/C11H19NO2/c1-7(13)4-12-5-8-9(6-12)11-3-2-10(8)14-11/h7-11,13H,2-6H2,1H3
charge 0 multiplicity 1
33 atoms
O  2.601217 -1.090692 0.716259
O  -4.194433 0.759982 -1.279198
N  -1.078757 -0.304118 0.604684
C  1.133353 0.74214 0.369781
C  0.941191 -0.312084 -0.795886
C  2.564011 0.400947 0.86918
C  2.292342 -1.07761 -0.751572
C  -0.008975 0.389043 1.379031
C  -0.303264 -1.153529 -0.349629
C  3.623272 0.868639 -0.168463
C  3.432999 -0.187297 -1.320418
C  -2.04261 0.609125 -0.067217
C  -3.380784 -0.100875 -0.389166
C  -4.153674 -0.51284 0.870846
H  1.056494 1.784918 0.014855
H  0.776175 0.166237 -1.777132
H  2.775401 0.646508 1.920221
H  2.266239 -2.117187 -1.109545
H  0.389208 -0.322329 2.127857
H  -0.416175 1.266589 1.909314
H  -0.935103 -1.470817 -1.196378
H  0.043293 -2.056075 0.188158
H  4.637931 0.809513 0.259294
H  3.447712 1.905794 -0.504736
H  3.160259 0.275535 -2.285235
H  4.350274 -0.781405 -1.467467
H  -2.250243 1.454635 0.619943
H  -1.655777 1.044711 -1.019128
H  -3.182207 -0.989379 -1.014651
H  -5.066501 -1.074218 0.606354
H  -4.449561 0.379189 1.459872
H  -3.508676 -1.14039 1.510108
H  -4.568826 1.500538 -0.736335
