program: Gaussian 09
title: 000230566
version: EM64L-G09RevD.01
frameworkgroup: C1[X(C9H14N2O2S)]
method: RPBEPBE
basis: SDD
operation: Freq
keyword: #p
keyword: freq=noraman
keyword: PBEPBE/SDD
title: #p freq=noraman PBEPBE/SDD
converged: YES YES NO NO
title: Mulliken charges:
elementType: S O O N N C C C C C C C C C H H H H H H H H H H H H H H
charge: 0.927176 -0.534704 -0.528160 -0.321771 -0.005248 -0.340994 -0.337865 0.025647 -0.656892 -0.654348 -0.201222 -0.328867 -0.171674 -0.302451 0.260233 0.220785 0.237551 0.227591 0.226801 0.257648 0.216794 0.263255 0.212183 0.213832 0.308861 0.286169 0.246117 0.253553
chargesum: 0.00000
title: Mulliken charges with hydrogens summed into heavy atoms:
elementType: S O O N N C C C C C C C C C
charge: 0.927176 -0.534704 -0.528160 -0.321771 -0.005248 0.140024 0.127277 0.025647 0.044351 0.034923 0.107639 -0.042698 0.074443 -0.048898
polarizability: 1.84971482e+02 -1.06147356e+01 1.24470814e+02 1.52406495e+00 1.19868128e+01 1.16997611e+02
1716.lowfreq: -13.8684 -4.5952 -0.0006 0.0009 0.0014 4.7867 26.9661 33.7579 59.1977
frequency: 26.8291 33.7409 59.1768 77.1407 106.1547 128.0009 151.1216 174.5629 200.1835 211.6157 232.1969 251.4137 256.1762 277.1484 324.6505 368.1919 384.5265 396.1255 413.0338 463.1002 492.9302 577.1982 596.1399 685.5146 707.5633 738.6773 755.2518 790.8456 816.9466 819.6853 900.4388 910.4868 924.0034 956.4459 970.8315 1000.3741 1003.9495 1016.0557 1055.3863 1061.7893 1073.7372 1083.8628 1104.9748 1159.0981 1179.0662 1189.7476 1273.3892 1300.5728 1302.9654 1315.6421 1342.4934 1352.1135 1385.7172 1392.8394 1409.4866 1432.5260 1438.4571 1449.3220 1468.8761 1472.1846 1485.9288 1491.8768 1542.7435 1568.5736 2977.7129 2988.6203 2993.9195 2996.6142 3030.4751 3062.6033 3081.0696 3086.0648 3107.6527 3117.3759 3141.8993 3152.2631 3160.7647 3174.2708
redmass: 4.1656 4.2067 3.8088 2.0874 2.4210 5.7161 3.5088 2.5282 2.6108 3.1727 5.7712 2.4337 2.5738 1.5520 5.1456 3.1596 3.6522 3.3859 4.4580 4.8750 4.9791 3.9704 7.8688 7.5426 2.2649 1.9581 1.2142 11.0556 1.5761 1.4999 2.2328 1.4159 13.3301 1.4063 6.7233 1.4656 2.6165 4.1236 1.9107 2.1860 1.7924 1.7956 1.5970 1.8335 3.0483 1.3179 1.2311 1.1637 8.2117 1.2697 1.2107 1.1771 1.2034 1.1927 2.0578 1.7765 1.0755 1.0729 1.0446 1.0452 1.0473 1.0498 5.7607 6.7457 1.0599 1.0369 1.0438 1.0562 1.1013 1.0999 1.0983 1.0977 1.1022 1.1002 1.0883 1.0922 1.0931 1.1002
irintensity: 0.7168 2.1337 1.3865 0.7356 0.6977 2.0425 3.4188 2.4215 2.2820 2.7637 12.3059 4.1804 4.2225 2.0001 1.3585 3.7831 12.9989 14.6736 12.9448 40.8489 13.1894 116.4768 14.8978 10.2180 32.7909 38.9212 3.8514 94.7130 0.6210 28.2961 6.2117 0.4495 74.3013 0.1683 10.1948 3.1118 32.4158 3.7420 5.2062 12.7992 5.6358 6.6991 8.1581 1.7653 42.8165 6.5075 14.6335 16.7965 5.6600 5.6145 4.5795 8.2469 17.6597 42.8099 28.7122 13.8067 10.3072 10.8591 5.6670 16.1682 6.8859 13.3492 6.0301 5.7215 19.8854 25.6143 28.7390 20.9965 10.3013 4.5912 51.1319 17.3628 14.0743 24.0472 10.3440 3.4628 1.0026 21.3232
temp: 298.150 k
press: 1.00000 atm
elementType: 16 8 8 7 7 6 6 6 6 6 6 6 6 6 1 1 1 1 1 1 1 1 1 1 1 1 1 1
symmnumber: 1
zpe: 577814.9 jmol-1
zpe.correction: 0.220078 hartree
zpe.thermalcorrener: 0.235740 hartree
zpe.thermalcorrenthalpy: 0.236684 hartree
zpe.thermalcorrgfe: 0.176096 hartree
zpe.sumelectzpe: -1008.091732 hartree
zpe.sumelectthermal: -1008.076070 hartree
zpe.sumelectthermalent: -1008.075126 hartree
zpe.sumelectthermalfe: -1008.135715 hartree
dipole: -0.3391 3.9506 -2.4542
dipole: 4.6632
quadrupole: -78.1027 -94.9855 -99.3148
quadrupole: -6.2028 -11.7589 1.2866
quadrupole: 12.6983 -4.1845 -8.5138 -6.2028 -11.7589 1.2866
hfenergy: -1008.3118104 hartree
pointgroup: C01 [X(C9H14N2O2S1)]
dipole: -0.0253091 -0.4805048 -1.7704321 debye
polarizability: 178.4226641|-17.9368902|139.041365|-9.1242137|5.4943161|108.9758782 unknown
InChI: InChI=1S/C9H14N2O2S/c1-3-11(4-2)14(12,13)9-6-5-7-10-8-9/h5-8H,3-4H2,1-2H3
charge 0 multiplicity 1
28 atoms
S  -0.571255 0.088237 0.806015
O  -1.197801 -1.404718 1.074521
O  -0.525416 1.190731 2.003721
N  -1.303369 0.984578 -0.656797
N  3.321212 0.693545 -0.519832
C  -2.320274 1.999564 -0.248545
C  -1.550968 0.090529 -1.823112
C  1.188706 -0.207618 0.156916
C  -3.552307 1.525452 0.558107
C  -2.804394 -0.815213 -1.819846
C  1.620041 -1.5359 0.022027
C  2.034929 0.886181 -0.101642
C  2.953732 -1.732353 -0.406273
C  3.755985 -0.596194 -0.665148
H  -1.785321 2.767907 0.336425
H  -2.632595 2.469225 -1.202463
H  -1.572665 0.769765 -2.698748
H  -0.644582 -0.534169 -1.944746
H  -4.145312 0.764965 0.026043
H  -3.238064 1.111284 1.531745
H  -4.205371 2.394633 0.760887
H  -2.825875 -1.448573 -0.917152
H  -3.73682 -0.227808 -1.871636
H  -2.775811 -1.47439 -2.707707
H  0.939193 -2.361689 0.255739
H  1.696583 1.919451 0.020039
H  3.362028 -2.739419 -0.532817
H  4.793289 -0.708303 -0.999221
