program: Gaussian 09
title: 000230552
version: EM64L-G09RevD.01
frameworkgroup: C1[X(C13H14N4O4S2)]
method: RPBEPBE
basis: SDD
operation: Freq
keyword: #p
keyword: freq=noraman
keyword: PBEPBE/SDD
title: #p freq=noraman PBEPBE/SDD
converged: YES YES NO NO
title: Mulliken charges:
elementType: S S O O O O N N N N C C C C C C C C C C C C C H H H H H H H H H H H H H H
charge: 0.923126 0.265829 -0.492275 -0.528991 -0.252290 -0.268633 -0.460473 -0.442848 -0.013484 -0.617710 -0.078338 0.506424 -0.254561 -0.155989 -0.323653 -0.447927 -0.565646 0.228271 -0.513755 -0.126916 0.245575 -0.481545 -0.151052 0.288657 0.294927 0.319897 0.235160 0.297133 0.230842 0.316740 0.289852 0.229772 0.314024 0.273226 0.259732 0.318999 0.337907
chargesum: 0.00000
title: Mulliken charges with hydrogens summed into heavy atoms:
elementType: S S O O O O N N N N C C C C C C C C C C C C C
charge: 0.923126 0.265829 -0.492275 -0.528991 -0.252290 -0.268633 -0.143733 -0.128824 -0.013484 0.039195 -0.078338 0.506424 0.034096 0.138938 -0.003756 -0.212768 -0.037672 0.228271 0.005868 -0.126916 0.245575 -0.208319 0.108680
polarizability: 4.19949743e+02 4.41872391e+01 2.37525030e+02 7.48208969e+00 -2.28774932e+01 1.38973343e+02
1716.lowfreq: -11.5979 -5.2014 -2.0885 0.0013 0.0014 0.0016 2.1802 15.7462 22.0136
frequency: -8.4415 15.7325 21.9682 28.9300 36.1739 42.4839 58.5300 73.2019 74.8559 83.4803 96.9816 124.6271 140.8987 150.7796 174.9865 186.6004 206.0996 256.7240 287.1329 296.9160 317.3348 332.8114 373.3779 383.1797 403.6752 409.8835 428.8628 460.4433 492.7524 498.8539 521.1379 531.1434 535.0258 559.9598 590.6170 593.4142 612.0220 621.9251 629.5622 651.8250 660.5602 704.8820 713.0804 725.7550 729.5011 773.1388 790.0716 812.5717 822.8334 831.3080 841.9760 869.8991 872.2526 873.1263 938.4353 946.0786 950.6638 985.2618 1002.2775 1004.8627 1011.9331 1052.9538 1057.7858 1074.9257 1090.6480 1123.8166 1146.9012 1171.5703 1189.1647 1219.9288 1241.3977 1262.4943 1263.9744 1275.9471 1295.9194 1297.6601 1338.6582 1373.1607 1382.7064 1408.4944 1426.0057 1444.8158 1454.2385 1474.9818 1487.6014 1504.7131 1593.2704 1597.2266 1599.4563 1631.5315 1645.0119 2971.1071 2991.6896 3027.4511 3055.0592 3127.5043 3160.2269 3169.3661 3198.6938 3199.5125 3246.5650 3419.5158 3518.1736 3520.1143 3673.0627
redmass: 4.5363 8.0202 6.0070 5.6485 8.7685 5.1467 5.9069 5.5569 4.4449 4.6782 6.7062 5.1416 8.4357 9.9591 7.5709 8.9716 4.9521 7.4278 7.6804 6.3205 5.9829 9.7095 4.6579 5.8736 8.8514 2.9930 4.4150 3.1159 1.6070 4.4084 2.8471 1.4274 7.1227 2.6710 5.4359 3.2817 5.4171 4.8461 4.7920 1.7725 1.2392 2.6316 4.6111 3.2161 1.6028 2.1643 2.1450 6.5595 1.4855 3.7326 5.2616 2.4202 1.3471 1.5841 5.7947 6.2557 1.5751 5.5148 1.3506 3.0160 2.0960 2.5265 2.0540 1.2633 3.0299 1.3065 1.3421 1.9472 1.1357 1.2628 1.2913 2.0336 2.5072 1.5392 1.4468 2.0760 1.8109 3.5132 3.1025 4.6257 5.1063 1.0824 1.0999 2.2369 5.8335 2.3059 6.8285 1.5344 5.0894 4.3359 3.3898 1.0611 1.0600 1.0976 1.1007 1.0905 1.0913 1.0960 1.0951 1.0919 1.1005 1.0768 1.0447 1.0764 1.1044
irintensity: 2.5317 1.4739 1.4598 8.5692 2.8236 0.9376 2.4540 4.2053 4.6004 0.9636 0.8997 7.4969 2.7053 4.7320 11.3711 5.5773 37.4652 12.9479 23.8876 9.8099 21.6563 18.3556 10.5069 18.0063 29.8546 0.1460 43.6658 72.9394 44.7139 35.4367 66.9490 161.9458 5.4942 70.4383 5.9584 11.4610 10.8030 23.1440 38.5621 74.0962 43.3092 69.4393 1.0176 0.8467 35.0642 143.3582 5.4434 123.5018 34.4741 15.0970 2.8998 2.5225 2.8896 60.7765 21.9899 29.8730 5.1168 0.8355 8.5137 110.6988 12.1859 46.1657 5.4555 7.6938 0.7735 12.3658 25.5687 115.5979 44.7106 22.3403 82.0993 166.8603 4.9622 42.7010 19.3588 7.5932 63.7783 459.0251 10.6905 25.2491 35.9719 4.6437 42.7382 27.5671 22.3359 627.7287 156.4310 73.7367 17.8933 133.5472 244.9324 40.8164 37.4917 14.6309 18.7070 11.4913 6.2394 13.1265 11.7336 8.8954 1.1640 30.9299 41.2776 15.0928 26.7157
temp: 298.150 k
press: 1.00000 atm
elementType: 16 16 8 8 8 8 7 7 7 7 6 6 6 6 6 6 6 6 6 6 6 6 6 1 1 1 1 1 1 1 1 1 1 1 1 1 1
symmnumber: 1
zpe: 691264.4 jmol-1
zpe.correction: 0.263289 hartree
zpe.thermalcorrener: 0.286052 hartree
zpe.thermalcorrenthalpy: 0.286996 hartree
zpe.thermalcorrgfe: 0.206853 hartree
zpe.sumelectzpe: -1817.973614 hartree
zpe.sumelectthermal: -1817.950851 hartree
zpe.sumelectthermalent: -1817.949906 hartree
zpe.sumelectthermalfe: -1818.030049 hartree
dipole: 4.3151 -3.0541 1.7837
dipole: 5.5794
quadrupole: -102.2059 -156.7596 -153.4521
quadrupole: 32.8173 23.8779 -10.9864
quadrupole: 35.2666 -19.2871 -15.9795 32.8173 23.8779 -10.9864
hfenergy: -1818.2369022 hartree
pointgroup: C01 [X(C13H14N4O4S2)]
dipole: 1.626169 -1.1106712 -0.9697614 debye
polarizability: 424.1705814|4.6573737|165.1120084|34.5657643|48.0628974|207.1655254 unknown
InChI: InChI=1S/C13H14N4O4S2/c14-11(18)5-6-12(19)16-9-1-3-10(4-2-9)23(20,21)17-13-15-7-8-22-13/h1-4,7-8,16-17H,5-6,14H2
charge 0 multiplicity 1
37 atoms
S  -3.210493 0.611193 1.874857
S  -6.762506 0.988176 -0.640939
O  -3.942106 -0.819858 2.118398
O  -3.163973 1.768644 3.021871
O  3.729061 1.213585 0.937426
O  7.064139 0.161427 -2.34742
N  2.412731 -0.378479 -0.177847
N  -4.091212 1.528291 0.269392
N  -4.481291 -0.349689 -1.171729
N  8.565736 0.039486 -0.585923
C  -1.477611 0.331264 1.233996
C  1.116829 -0.097891 0.325377
C  -0.449309 1.142496 1.737968
C  -1.27317 -0.681261 0.280372
C  0.866899 0.923291 1.284743
C  0.041402 -0.891131 -0.169781
C  4.81185 -0.288816 -0.686013
C  3.626458 0.258401 0.113857
C  6.158487 0.095105 -0.054051
C  -4.900096 0.719347 -0.488939
C  7.28205 0.093207 -1.100709
C  -6.780447 -0.425167 -1.73129
C  -5.513335 -0.987549 -1.844941
H  -0.670208 1.918703 2.477471
H  -2.111877 -1.265765 -0.109084
H  1.697251 1.525662 1.655551
H  0.232728 -1.670111 -0.917808
H  4.791834 0.1378 -1.710521
H  4.730837 -1.385975 -0.808581
H  2.4638 -1.13554 -0.864658
H  6.062034 1.115457 0.367265
H  6.410683 -0.570345 0.792458
H  -4.54125 2.355468 0.698653
H  -7.697247 -0.725098 -2.234279
H  -5.285206 -1.86884 -2.445594
H  8.745754 -0.004411 0.415616
H  9.353275 0.086121 -1.232268
