program: Gaussian 09
title: 000230548
version: EM64L-G09RevD.01
frameworkgroup: C1[X(C11H14O2S2)]
method: RPBEPBE
basis: SDD
operation: Freq
keyword: #p
keyword: freq=noraman
keyword: PBEPBE/SDD
title: #p freq=noraman PBEPBE/SDD
converged: YES YES NO NO
title: Mulliken charges:
elementType: S S O O C C C C C C C C C C C H H H H H H H H H H H H H H
charge: 0.950703 0.206450 -0.565378 -0.560180 -0.447045 -0.544054 -0.380587 -0.568099 -0.795641 0.487614 -0.385036 -0.366865 -0.218192 -0.218661 -0.233727 0.285211 0.287667 0.291745 0.264523 0.245762 0.280459 0.283174 0.266810 0.267715 0.235514 0.236750 0.230739 0.229818 0.232808
chargesum: 0.00000
title: Mulliken charges with hydrogens summed into heavy atoms:
elementType: S S O O C C C C C C C C C C C
charge: 0.950703 0.206450 -0.565378 -0.560180 -0.161834 0.035358 0.129699 -0.004465 -0.261116 0.487614 -0.149522 -0.130114 0.012547 0.011157 -0.000919
polarizability: 2.60067760e+02 -2.96630592e+00 1.42436466e+02 6.35033370e+00 1.03785273e+01 1.20482636e+02
1716.lowfreq: -10.9602 -0.0031 -0.0014 0.0012 4.0388 9.0295 14.6849 17.7068 34.4926
frequency: 13.7284 17.6363 34.4019 40.5822 56.8943 97.9210 139.7004 198.8128 208.8025 226.6555 256.0048 263.9280 296.6778 325.3629 357.2655 402.0110 413.2961 440.9361 474.9644 525.3612 552.1300 585.0328 616.6871 650.6104 701.3525 727.0591 776.0320 800.9832 808.0512 815.9002 835.4797 852.0617 883.2363 892.0170 926.5659 931.9143 947.8316 977.8988 990.0830 998.5523 1004.1765 1026.4399 1066.4447 1072.1521 1084.9053 1122.3119 1130.9442 1169.2307 1173.0430 1174.2385 1188.5162 1217.9612 1223.6450 1243.4264 1249.8271 1309.4898 1326.3856 1340.6712 1385.8635 1415.4060 1423.5319 1440.9768 1457.7530 1459.6612 1483.8759 1594.3112 1613.4883 3010.7706 3019.5314 3029.6697 3061.9349 3063.8631 3079.8198 3095.9565 3123.8176 3125.2828 3138.3650 3150.8167 3163.1680 3167.2205 3167.5138
redmass: 4.4452 4.9258 5.7079 4.8294 5.0328 5.5740 3.9395 4.9492 5.2893 4.0730 3.5048 6.8410 5.1307 2.3724 6.5406 2.7960 2.5584 6.4551 3.7862 4.6950 5.8890 6.6556 6.3290 4.6429 1.6850 2.2442 2.1451 7.0939 4.2503 2.2075 1.9347 1.2505 2.5620 1.5232 1.4623 2.9796 1.3801 1.3917 6.1524 1.3255 2.1691 2.2020 1.3971 1.4975 2.2518 1.2239 1.1862 1.3737 1.2949 1.0549 1.1136 1.3503 2.2556 1.2815 1.2854 1.2743 1.2765 1.2225 8.6708 1.1064 1.0963 2.1690 1.0898 1.1206 2.3430 6.0804 6.1326 1.0612 1.0578 1.0840 1.0589 1.0557 1.1008 1.1089 1.0859 1.0882 1.0917 1.0962 1.1120 1.1017 1.1126
irintensity: 2.0986 1.0456 1.8320 1.8844 3.2296 1.2957 1.5197 0.5469 5.7327 3.2113 1.3021 7.9023 12.0850 1.6555 37.0836 0.1026 2.3585 8.7866 5.2557 1.8069 16.1486 22.9084 0.1183 39.9923 60.4032 10.3344 25.5478 65.4935 23.8488 35.4840 8.8503 0.0255 8.0294 2.0279 7.5240 70.5634 2.3611 0.0235 0.6035 0.0618 3.6362 6.8347 9.4713 8.6564 7.9761 5.4493 1.1003 6.3335 11.3004 0.3167 1.1329 1.7289 7.5135 4.3307 15.3769 13.9599 0.2214 2.0264 0.3410 12.9100 9.3985 8.6713 8.5874 6.3262 12.7744 1.2486 1.0803 7.0727 21.0797 6.3006 2.8178 2.7062 9.6408 7.1191 6.9640 2.2219 12.4500 36.1558 0.9807 23.0632 0.2844
temp: 298.150 k
press: 1.00000 atm
elementType: 16 16 8 8 6 6 6 6 6 6 6 6 6 6 6 1 1 1 1 1 1 1 1 1 1 1 1 1 1
symmnumber: 1
zpe: 591295.1 jmol-1
zpe.correction: 0.225212 hartree
zpe.thermalcorrener: 0.240958 hartree
zpe.thermalcorrenthalpy: 0.241902 hartree
zpe.thermalcorrgfe: 0.177988 hartree
zpe.sumelectzpe: -1372.847794 hartree
zpe.sumelectthermal: -1372.832049 hartree
zpe.sumelectthermalent: -1372.831105 hartree
zpe.sumelectthermalfe: -1372.895018 hartree
dipole: -5.8295 3.0766 -0.2127
dipole: 6.5950
quadrupole: -127.0924 -98.3919 -112.4417
quadrupole: 18.3150 -5.2070 2.9162
quadrupole: -14.4504 14.2501 0.2003 18.3150 -5.2070 2.9162
hfenergy: -1373.0730068 hartree
pointgroup: C01 [X(C11H14O2S2)]
dipole: 2.2786823 -1.2240922 -0.2038056 debye
polarizability: 259.8100152|-3.7770279|143.9300787|-8.4598922|-8.5016642|119.2467674 unknown
InChI: InChI=1S/C11H14O2S2/c12-15(13)7-6-11(9-15)14-8-10-4-2-1-3-5-10/h1-5,11H,6-9H2
charge 0 multiplicity 1
29 atoms
S  -4.285474 0.457543 0.227265
S  0.005302 -0.534812 -0.801726
O  -4.668764 0.509152 1.818097
O  -5.160788 1.271779 -0.888295
C  -1.723522 -0.5503 -0.015075
C  -2.356351 0.836467 0.000243
C  -2.629932 -1.508229 -0.843608
C  -4.067528 -1.423443 -0.316336
C  1.000636 0.261337 0.639804
C  2.476346 0.185094 0.331071
C  3.142254 1.280665 -0.276136
C  3.218238 -0.985965 0.635719
C  4.523031 1.211147 -0.567118
C  4.598248 -1.057245 0.346395
C  5.254805 0.041961 -0.255817
H  -1.611595 -0.93915 1.013887
H  -2.098777 1.478194 0.853845
H  -2.297003 1.359675 -0.966025
H  -2.247188 -2.541011 -0.765743
H  -2.5952 -1.213623 -1.909114
H  -4.853273 -1.593118 -1.065132
H  -4.246367 -1.982131 0.614301
H  0.738207 -0.308314 1.5475
H  0.659451 1.303769 0.742024
H  2.577165 2.18828 -0.520702
H  2.710446 -1.841108 1.097799
H  5.026085 2.065505 -1.033186
H  5.161044 -1.965063 0.590255
H  6.326006 -0.012354 -0.479288
