program: Gaussian 09
title: 000230542
version: EM64L-G09RevD.01
frameworkgroup: C1[X(C15H22N2O2)]
method: RPBEPBE
basis: SDD
operation: Freq
keyword: #p
keyword: freq=noraman
keyword: PBEPBE/SDD
title: #p freq=noraman PBEPBE/SDD
converged: YES YES NO NO
title: Mulliken charges:
elementType: O O N N C C C C C C C C C C C C C C C H H H H H H H H H H H H H H H H H H H H H H
charge: -0.261529 -0.222469 -0.126040 -0.061875 -0.345706 -0.353513 -0.396417 -0.395105 -0.236143 0.409257 -0.613490 0.177418 -0.353149 -0.428820 -0.231213 -0.227175 -0.242333 -0.260715 -0.664534 0.223954 0.186082 0.192004 0.229454 0.205019 0.193983 0.190074 0.206156 0.229647 0.221686 0.187527 0.221639 0.278826 0.237640 0.225506 0.224669 0.227266 0.224251 0.235885 0.217664 0.247610 0.227011
chargesum: 0.00000
title: Mulliken charges with hydrogens summed into heavy atoms:
elementType: O O N N C C C C C C C C C C C C C C C
charge: -0.261529 -0.222469 -0.126040 -0.061875 0.064330 0.067945 0.002584 0.001125 -0.006496 0.409257 0.017362 0.177418 -0.074323 -0.191180 -0.005707 -0.002507 -0.015067 0.199420 0.027751
polarizability: 1.90482547e+02 1.74949234e+01 1.95837829e+02 1.19599598e+01 -5.63782819e+00 1.50959125e+02
1716.lowfreq: -7.6637 -0.0008 -0.0005 -0.0004 5.3302 9.8448 28.0145 36.3086 47.3148
frequency: 27.9842 36.2985 47.2878 50.6162 57.3456 74.2825 96.0657 136.1429 142.9894 199.4773 214.2649 222.2481 228.9993 238.2316 247.0561 280.4788 301.2922 322.3688 340.6256 365.3995 401.0254 405.6072 422.7497 470.2093 480.9739 506.4948 585.9305 613.6398 632.9502 676.2373 696.1250 707.8846 751.2706 764.3110 792.6679 807.9163 837.2489 846.1146 849.0736 858.1218 898.5398 931.4129 950.9681 982.8208 990.0526 998.9773 1004.4591 1012.4820 1025.8160 1031.1742 1049.5986 1074.2388 1077.3738 1083.1418 1092.6014 1100.6642 1123.9466 1139.9041 1147.5910 1149.0787 1156.7272 1171.2906 1182.4237 1193.4559 1198.7025 1223.1168 1264.5597 1278.7985 1279.6858 1288.4972 1307.5302 1316.6541 1333.9985 1343.9426 1355.2749 1359.3149 1374.6966 1383.1578 1390.5982 1392.4074 1429.1313 1441.7106 1452.9159 1453.3705 1456.9946 1459.6889 1462.9568 1466.6074 1475.7169 1478.8728 1481.2879 1484.1672 1594.9948 1609.0282 1642.7941 2846.2546 2851.1633 2863.8622 2868.9082 2875.2099 2884.2761 2992.4382 3016.3286 3024.2680 3028.6451 3029.4209 3055.8507 3061.5645 3074.5835 3087.3941 3092.8318 3119.0231 3120.1624 3127.8727 3140.6421 3153.6516 3164.7205
redmass: 4.1383 3.6394 3.1375 3.7315 2.8890 3.6692 5.2021 3.1127 5.5720 1.4458 2.4256 1.4187 2.6234 4.4967 2.2971 2.4796 2.3905 2.6521 3.4661 2.9220 2.0141 2.8304 3.6341 4.0989 2.8881 3.5826 4.3327 6.0877 2.4014 4.9544 4.4282 1.7870 3.1513 2.3100 3.0020 1.2999 4.1617 3.9656 1.5607 1.2531 2.8598 1.5741 2.1392 1.3843 6.1782 1.3455 2.4009 2.6528 2.2229 2.7515 1.6007 1.6902 1.6616 1.6490 2.6297 2.7135 1.9045 2.2283 3.4380 3.0935 1.6721 1.0632 1.1667 2.0728 1.2112 2.1439 1.6363 1.1480 1.3995 1.5374 1.2341 1.3862 1.2959 1.2675 1.3017 1.4150 1.4185 3.5538 1.2352 1.8700 1.1738 2.1183 1.0812 1.0803 1.0926 1.0630 1.0436 1.0983 1.1120 2.2613 1.0534 1.0518 6.1953 6.0734 9.0074 1.0651 1.0664 1.0675 1.0705 1.0741 1.0737 1.0360 1.0726 1.0883 1.0900 1.0598 1.0881 1.0890 1.1009 1.0973 1.1031 1.1061 1.0853 1.0879 1.0927 1.0957 1.1008
irintensity: 1.3558 0.1661 0.7913 0.1408 0.0996 0.8923 0.1615 2.1313 3.1803 2.7494 0.8693 0.0476 1.8710 1.0211 0.3612 3.4596 1.5205 9.0515 16.9418 0.7401 0.2371 0.2086 1.3708 0.5988 1.0659 11.6218 6.6119 0.8057 1.4818 7.3015 2.9812 62.5709 10.0369 26.4852 29.7193 1.5033 10.1797 7.7469 0.7210 0.0813 4.6940 4.3827 8.2473 0.7796 0.2429 4.5603 32.3942 63.1049 5.6831 38.4062 7.0883 2.2926 8.8618 3.5533 213.0727 147.9385 13.7313 5.4374 61.5341 46.8472 17.2139 0.3909 2.5703 1.6633 0.8090 22.7721 15.0693 4.4414 19.0350 29.5614 10.0480 26.6475 2.4506 0.4561 1.0278 8.0912 4.9587 1.2575 22.7850 5.2081 1.6901 12.6552 1.9488 0.9567 10.4396 28.7201 13.7329 12.5894 8.4827 16.6501 8.1827 13.1017 1.7209 6.2392 116.4759 54.2486 82.5027 69.2735 11.9170 81.2312 225.5070 20.9403 48.0103 48.3452 56.0249 21.7010 32.0942 18.2710 35.3609 36.4717 0.9987 31.5475 2.7839 2.6453 27.4362 22.5957 21.2123
temp: 298.150 k
press: 1.00000 atm
elementType: 8 8 7 7 6 6 6 6 6 6 6 6 6 6 6 6 6 6 6 1 1 1 1 1 1 1 1 1 1 1 1 1 1 1 1 1 1 1 1 1 1
symmnumber: 1
zpe: 910746.9 jmol-1
zpe.correction: 0.346885 hartree
zpe.thermalcorrener: 0.365905 hartree
zpe.thermalcorrenthalpy: 0.366849 hartree
zpe.thermalcorrgfe: 0.298098 hartree
zpe.sumelectzpe: -843.260828 hartree
zpe.sumelectthermal: -843.241808 hartree
zpe.sumelectthermalent: -843.240864 hartree
zpe.sumelectthermalfe: -843.309616 hartree
dipole: -0.5822 0.3719 -1.1092
dipole: 1.3068
quadrupole: -103.9412 -101.7905 -116.9464
quadrupole: -2.3883 4.7817 -2.3543
quadrupole: 3.6182 5.7689 -9.3871 -2.3883 4.7817 -2.3543
hfenergy: -843.6077133 hartree
pointgroup: C01 [X(C15H22N2O2)]
dipole: -0.2029262 0.2060223 -0.4250941 debye
polarizability: 199.5562278|16.2502225|187.8021279|8.9031718|-8.0981505|149.9211453 unknown
InChI: InChI=1S/C15H22N2O2/c1-3-19-15(18)14(13-7-5-4-6-8-13)17-11-9-16(2)10-12-17/h4-8,14H,3,9-12H2,1-2H3
charge 0 multiplicity 1
41 atoms
O  -1.409875 2.436698 -0.56054
O  -0.444983 1.838514 1.479166
N  1.07996 -0.135477 -0.121484
N  3.879243 -0.812012 -0.505728
C  2.118555 0.920456 -0.265395
C  1.486312 -1.350728 -0.878326
C  3.474006 0.402963 0.239605
C  2.843173 -1.862734 -0.37291
C  -0.275603 0.325943 -0.509319
C  -1.350651 -0.729828 -0.210875
C  5.219495 -1.29032 -0.119325
C  -0.673989 1.592754 0.275303
C  -1.373191 -1.377065 1.050366
C  -2.346853 -1.031814 -1.168338
C  -2.378536 -2.324055 1.341733
C  -3.355134 -1.978933 -0.875406
C  -3.372941 -2.627847 0.380645
C  -1.984251 3.666586 0.071928
C  -0.978142 4.819685 0.024767
H  1.826169 1.796815 0.337818
H  2.228636 1.23836 -1.332641
H  1.567134 -1.135096 -1.973574
H  0.722496 -2.134514 -0.737089
H  4.242327 1.184759 0.088999
H  3.392341 0.203973 1.338786
H  2.727669 -2.194145 0.691398
H  3.148417 -2.740637 -0.973145
H  -0.337126 0.596074 -1.592152
H  5.499147 -2.158138 -0.74373
H  5.287533 -1.601184 0.954804
H  5.963475 -0.491541 -0.291094
H  -0.596773 -1.12864 1.781831
H  -2.334725 -0.524732 -2.140733
H  -2.391499 -2.82209 2.317962
H  -4.121271 -2.210267 -1.624049
H  -4.153727 -3.362232 0.609264
H  -2.881264 3.873056 -0.533452
H  -2.270344 3.423939 1.110489
H  -1.451035 5.742198 0.410137
H  -0.097639 4.597733 0.650684
H  -0.644633 5.009819 -1.010081
