program: Gaussian 09
title: 000230535
version: EM64L-G09RevD.01
frameworkgroup: C1[X(C9H19NO)]
method: RPBEPBE
basis: SDD
operation: Freq
keyword: #p
keyword: freq=noraman
keyword: PBEPBE/SDD
title: #p freq=noraman PBEPBE/SDD
converged: YES YES NO NO
title: Mulliken charges:
elementType: O N C C C C C C C C C H H H H H H H H H H H H H H H H H H H
charge: -0.266616 -0.618273 -0.030003 -0.133489 -0.389219 -0.425991 -0.769995 -0.373042 0.197350 -0.714422 -0.702733 0.191237 0.183138 0.233339 0.203443 0.243388 0.194993 0.231170 0.230940 0.194898 0.205572 0.187064 0.218017 0.234958 0.199506 0.215987 0.209838 0.212441 0.310424 0.326078
chargesum: 0.00000
title: Mulliken charges with hydrogens summed into heavy atoms:
elementType: O N C C C C C C C C C
charge: -0.266616 0.018229 0.161234 0.049649 0.047563 0.012390 -0.112986 0.019594 0.197350 -0.061940 -0.064467
polarizability: 1.17379712e+02 -4.32815949e+00 1.05585432e+02 -1.71788862e+00 3.08698671e+00 9.75641701e+01
1716.lowfreq: -14.4202 -2.2973 -0.0007 -0.0006 -0.0004 5.8636 25.9229 59.3696 71.9674
frequency: 25.0761 59.3096 71.8950 88.1262 97.7275 115.4083 175.6503 190.4184 219.2138 234.7899 242.1518 280.1306 293.5048 314.6555 377.6091 433.5970 447.1345 487.6776 500.9464 587.7697 632.7120 707.7378 736.9040 757.5853 804.9671 843.3160 871.6648 904.8931 921.7375 963.3990 993.7602 1026.3975 1038.2959 1050.4914 1063.6435 1084.4179 1103.1467 1123.2103 1158.4655 1170.0351 1218.3205 1247.1575 1258.8494 1274.3179 1277.2051 1293.2827 1305.7110 1328.9315 1339.6190 1354.9457 1384.9521 1388.0262 1390.3837 1392.4254 1458.9707 1462.9229 1473.8361 1476.7324 1477.8287 1478.7146 1483.0326 1484.4645 1487.4467 1588.3659 1632.5635 2937.0459 2950.3003 2960.9879 2969.8859 2972.1672 2972.8620 2981.6692 2985.1308 3010.4614 3044.2026 3047.2971 3057.5675 3069.8537 3070.9248 3072.2829 3077.2060 3080.1595 3511.3381 3670.6731
redmass: 3.6768 2.0197 2.7435 2.4030 2.5497 3.2469 2.9624 1.7932 1.7530 1.1557 1.1151 2.0043 3.1825 2.4444 2.9928 2.5486 2.3292 2.5216 1.2516 1.6562 2.0427 2.4651 1.1268 2.5099 1.9310 1.3878 1.4796 1.7901 1.9635 1.8142 1.3355 2.1212 1.7922 2.1534 1.8115 2.2113 2.3290 1.9446 2.3438 2.2447 1.3678 1.4137 1.3025 1.2674 1.4778 1.1348 1.4273 1.4130 1.4036 1.5419 1.6543 1.2091 1.2176 1.3426 1.0777 1.0748 1.0662 1.0479 1.0493 1.0503 1.0508 1.0514 1.0733 1.5323 2.9732 1.0821 1.0835 1.0601 1.0380 1.0364 1.0363 1.0606 1.0629 1.0972 1.1014 1.0983 1.0979 1.0996 1.1006 1.0990 1.1007 1.0984 1.0446 1.1040
irintensity: 7.3153 4.5621 3.3168 0.6628 1.7995 0.6335 0.3219 0.4875 2.3717 0.8419 0.0808 4.9000 2.3524 0.1912 1.8248 0.5602 0.5940 5.8666 189.1201 58.7770 31.9525 13.8479 4.9628 12.1165 1.5616 0.2579 7.6511 5.7355 6.9726 2.1560 3.7968 0.5786 0.4899 0.8584 4.3175 1.5234 4.0122 5.4371 1.3572 4.0149 7.6470 24.1519 6.8955 13.9095 54.3533 0.7295 18.7387 3.1725 3.0730 17.8854 20.3444 6.1949 14.9259 32.6435 5.4681 5.9232 2.2475 11.3377 10.2392 11.9088 10.3573 7.9155 14.2108 51.8370 248.8800 23.7929 35.0186 33.0960 48.4355 49.6690 23.6041 28.4070 29.6425 5.5928 17.5394 4.2958 39.5982 49.7401 80.4274 62.3548 44.8324 44.4824 26.4540 19.0011
temp: 298.150 k
press: 1.00000 atm
elementType: 8 7 6 6 6 6 6 6 6 6 6 1 1 1 1 1 1 1 1 1 1 1 1 1 1 1 1 1 1 1
symmnumber: 1
zpe: 703407.8 jmol-1
zpe.correction: 0.267914 hartree
zpe.thermalcorrener: 0.282201 hartree
zpe.thermalcorrenthalpy: 0.283146 hartree
zpe.thermalcorrgfe: 0.226385 hartree
zpe.sumelectzpe: -483.435564 hartree
zpe.sumelectthermal: -483.421276 hartree
zpe.sumelectthermalent: -483.420332 hartree
zpe.sumelectthermalfe: -483.477092 hartree
dipole: 1.0405 -1.7687 -3.0853
dipole: 3.7054
quadrupole: -66.5405 -64.0471 -75.8655
quadrupole: -5.9352 -2.8172 -0.8156
quadrupole: 2.2772 4.7706 -7.0478 -5.9352 -2.8172 -0.8156
hfenergy: -483.7034778 hartree
pointgroup: C01 [X(C9H19N1O1)]
dipole: 0.3638331 0.6972477 1.2274726 debye
polarizability: 117.039057|4.5875854|105.7962753|2.0605851|3.3003026|97.6939815 unknown
InChI: InChI=1S/C9H19NO/c1-4-6-7(3)8(5-2)9(10)11/h7-8H,4-6,10H2,1-3H3
charge 0 multiplicity 1
30 atoms
O  1.165229 0.347236 -1.842305
N  2.114011 1.90354 -0.418516
C  -0.569616 0.233886 0.919085
C  0.945531 -0.04202 0.592169
C  -1.534931 -0.262358 -0.190709
C  1.257193 -1.55099 0.414175
C  -0.801656 1.723997 1.27085
C  -3.032652 -0.151742 0.180912
C  1.406862 0.733196 -0.658104
C  2.767335 -1.86658 0.468453
C  -3.945846 -0.818849 -0.87111
H  -0.780327 -0.364473 1.833727
H  1.525102 0.328773 1.4659
H  -1.338604 0.293997 -1.127674
H  -1.312283 -1.323922 -0.415733
H  0.851351 -1.88193 -0.558991
H  0.726654 -2.117483 1.205678
H  -0.684175 2.368324 0.379728
H  -1.816666 1.886151 1.673469
H  -0.083487 2.069829 2.040121
H  -3.321962 0.912262 0.286298
H  -3.203603 -0.623278 1.171623
H  2.948707 -2.950804 0.353665
H  3.309811 -1.350807 -0.345121
H  3.211692 -1.550197 1.431927
H  -3.803104 -0.357154 -1.866258
H  -3.716309 -1.896776 -0.968821
H  -5.014071 -0.722247 -0.602115
H  2.310943 2.230904 0.525128
H  2.424671 2.458918 -1.216249
