program: Gaussian 09
title: 000230533
version: EM64L-G09RevD.01
frameworkgroup: C1[X(C8H16N2O2)]
method: RPBEPBE
basis: SDD
operation: Freq
keyword: #p
keyword: freq=noraman
keyword: PBEPBE/SDD
title: #p freq=noraman PBEPBE/SDD
converged: YES YES NO NO
title: Mulliken charges:
elementType: O O N N C C C C C C C C H H H H H H H H H H H H H H H H
charge: -0.194842 -0.215491 -0.451514 -0.645090 -0.393979 -0.196749 -0.346592 -0.352516 -0.710869 0.256387 -0.696952 0.280453 0.229752 0.194185 0.187499 0.209669 0.171185 0.191401 0.204728 0.220689 0.216777 0.246437 0.213242 0.218126 0.205416 0.301606 0.310461 0.346580
chargesum: 0.00000
title: Mulliken charges with hydrogens summed into heavy atoms:
elementType: O O N N C C C C C C C C
charge: -0.194842 -0.215491 -0.149908 0.011951 0.029958 -0.009250 0.034262 0.043613 -0.026966 0.256387 -0.060168 0.280453
polarizability: 1.20588445e+02 -9.09425368e+00 1.06246838e+02 6.15972612e-01 6.76847223e+00 9.69175470e+01
1716.lowfreq: -19.8205 -5.8230 -0.0009 -0.0007 -0.0006 9.8310 11.9870 32.8364 58.9857
frequency: -6.6438 32.7513 58.9207 61.9637 107.2743 114.0685 132.1577 151.0851 217.5192 224.9610 229.6494 241.1965 285.8113 329.5645 381.5449 399.9877 428.3260 465.1313 554.6248 562.2899 605.6503 657.8176 697.2933 730.7866 738.1936 795.0602 865.0251 892.8458 895.4210 915.4451 939.8175 1002.6703 1029.5473 1050.2585 1055.5854 1076.8341 1097.2354 1115.3637 1140.9813 1159.7842 1214.2142 1249.1729 1277.1135 1282.4577 1288.9534 1292.1251 1331.0265 1349.3179 1352.6193 1386.2260 1390.2680 1426.4985 1454.7502 1465.0609 1471.5449 1475.3021 1477.0083 1482.0878 1486.4075 1605.7286 1646.0893 1698.0958 2947.1361 2954.4281 2968.5704 2971.6974 2977.9046 2983.8866 2996.6520 3023.3508 3046.8367 3068.2052 3072.3927 3079.8360 3092.7361 3522.2237 3529.9388 3682.6410
redmass: 4.8437 5.7181 2.7456 1.9528 3.0738 3.7718 2.8033 3.2830 1.8674 1.0822 1.4666 3.2923 3.7112 3.5430 2.0319 3.7192 1.6280 2.9113 1.1654 3.1913 1.1635 2.6004 5.9153 1.1966 4.8007 1.2916 3.4057 1.9291 3.1140 1.3936 2.0380 1.6180 2.6857 2.1574 2.0387 2.2159 1.7857 1.8988 2.6609 2.2859 1.4646 1.2805 1.2623 1.4097 2.1799 1.1345 1.4264 1.5195 1.5798 1.2025 1.2179 2.1281 1.0779 1.0746 1.0484 1.0653 1.0427 1.0586 1.0799 1.2047 4.9479 7.1304 1.0631 1.0803 1.0593 1.0370 1.0621 1.0358 1.0940 1.1021 1.1033 1.1008 1.0992 1.1002 1.1005 1.0680 1.0537 1.1040
irintensity: 5.7288 11.4491 1.0047 0.7480 0.8480 0.6577 1.7743 1.7309 0.6083 0.2598 0.3547 0.3668 5.3705 1.5596 20.6522 7.2784 70.9071 3.9948 237.2508 14.7803 84.0642 4.9972 12.5233 15.2203 28.2807 1.4547 0.8538 3.7899 19.7709 4.7372 12.6390 3.3613 2.4957 13.0556 9.7958 4.7210 3.5487 41.9936 109.0352 56.1383 6.6054 1.1944 7.9310 31.3873 99.0506 10.3637 1.7307 3.9080 1.4502 13.6390 8.1401 677.5347 0.6560 0.8474 11.2581 5.8244 12.1717 11.9494 20.2218 60.5976 24.4711 375.0413 6.2468 48.5162 33.4428 34.5054 47.3761 34.8278 13.0424 11.1271 32.5491 88.3861 53.9477 36.3182 23.5708 11.3650 36.3165 32.0200
temp: 298.150 k
press: 1.00000 atm
elementType: 8 8 7 7 6 6 6 6 6 6 6 6 1 1 1 1 1 1 1 1 1 1 1 1 1 1 1 1
symmnumber: 1
zpe: 624815.2 jmol-1
zpe.correction: 0.237980 hartree
zpe.thermalcorrener: 0.251859 hartree
zpe.thermalcorrenthalpy: 0.252803 hartree
zpe.thermalcorrgfe: 0.196547 hartree
zpe.sumelectzpe: -573.463465 hartree
zpe.sumelectthermal: -573.449586 hartree
zpe.sumelectthermalent: -573.448641 hartree
zpe.sumelectthermalfe: -573.504897 hartree
dipole: -1.6208 -1.8953 -6.4403
dipole: 6.9063
quadrupole: -77.0120 -66.0315 -76.9268
quadrupole: -8.7588 -13.3301 2.3674
quadrupole: -3.6886 7.2919 -3.6033 -8.7588 -13.3301 2.3674
hfenergy: -573.7014443 hartree
pointgroup: C01 [X(C8H16N2O2)]
dipole: 0.5765645 0.1703798 -2.6497905 debye
polarizability: 121.2660323|-8.5106509|102.1416342|1.3236785|-7.9020976|100.3451639 unknown
InChI: InChI=1S/C8H16N2O2/c1-3-4-5-6(2)7(11)10-8(9)12/h6,10H,3-5,9H2,1-2H3
charge 0 multiplicity 1
28 atoms
O  -0.696004 -0.44787 1.613459
O  -3.416874 0.527766 0.927339
N  -1.62908 -0.100192 -0.520233
N  -3.293037 1.389002 -1.236229
C  1.783793 -1.150486 0.117669
C  0.352816 -1.578129 -0.298045
C  2.197803 0.242925 -0.405956
C  3.632473 0.637785 0.013171
C  0.054366 -3.042078 0.123503
C  -0.689045 -0.66089 0.377235
C  4.049641 2.028907 -0.510411
C  -2.825467 0.612628 -0.173592
H  1.835306 -1.161907 1.223841
H  2.499266 -1.91324 -0.250829
H  0.264911 -1.500052 -1.403196
H  1.490002 1.007744 -0.025248
H  2.124342 0.263057 -1.514809
H  4.345071 -0.128354 -0.355487
H  3.701441 0.621087 1.119413
H  -0.95655 -3.361927 -0.188438
H  0.79098 -3.728863 -0.331267
H  0.1179 -3.135504 1.221794
H  3.369864 2.814336 -0.129536
H  5.076347 2.289455 -0.194259
H  4.017602 2.064003 -1.616155
H  -1.464446 -0.276409 -1.514368
H  -2.717147 1.645457 -2.036261
H  -4.175471 1.876051 -1.091602
