program: Gaussian 09
title: 000230523
version: EM64L-G09RevD.01
frameworkgroup: C1[X(C12H19NO4)]
method: RPBEPBE
basis: SDD
operation: Freq
keyword: #p
keyword: freq=noraman
keyword: PBEPBE/SDD
title: #p freq=noraman PBEPBE/SDD
converged: NO YES NO NO
title: Mulliken charges:
elementType: O O O O N C C C C C C C C C C C C H H H H H H H H H H H H H H H H H H H
charge: -0.231712 -0.227644 -0.197676 -0.198059 0.132594 -0.144741 -0.052687 -0.042872 -0.481597 0.252007 -0.468894 -0.368024 -0.361306 -0.778480 -0.208470 -0.211742 -0.702440 0.237054 0.252700 0.221811 0.237301 0.243599 0.208776 0.204513 0.272904 0.185117 0.184364 0.272854 0.222711 0.218178 0.208538 0.202763 0.200438 0.247342 0.222968 0.247812
chargesum: 0.00000
title: Mulliken charges with hydrogens summed into heavy atoms:
elementType: O O O O N C C C C C C C C C C C C
charge: -0.231712 -0.227644 -0.197676 -0.198059 0.132594 0.092313 0.200013 0.178938 -0.000697 0.252007 -0.055606 0.089997 0.095912 -0.129054 -0.005706 -0.011304 0.015683
polarizability: 1.69816936e+02 -2.08006523e+00 1.41284731e+02 -4.76017046e+00 2.94435192e+00 1.20271358e+02
1716.lowfreq: -6.6737 -0.0006 -0.0004 0.0003 8.5595 12.5732 25.2697 40.8113 45.7459
frequency: 25.0249 40.7444 45.6918 79.9638 109.7466 133.8106 167.2561 176.4533 188.1052 203.5934 223.9572 253.8429 278.7138 290.7972 328.1272 352.9069 376.4363 383.1705 387.2850 443.6163 448.1383 477.4993 498.8071 515.4324 539.6894 596.7193 650.0778 672.2754 692.6193 762.1916 763.1351 776.5962 837.4308 851.4885 881.3998 891.9257 893.3752 919.5459 940.9001 955.1437 963.3581 975.9965 989.2088 995.9054 1014.5997 1045.9632 1057.4552 1085.8624 1093.3934 1098.6892 1123.0599 1132.8210 1160.9368 1174.6084 1205.2693 1208.2429 1219.1548 1229.7588 1264.9426 1275.6934 1283.0658 1293.7440 1302.5494 1326.7702 1327.7955 1344.5524 1348.9603 1358.5072 1364.0081 1368.3955 1379.4206 1385.7752 1395.1546 1409.3816 1438.6726 1445.6970 1455.5363 1464.0501 1469.8735 1474.0709 1477.8170 1488.4762 1678.6902 2899.2386 2936.8362 2940.1221 2949.2955 2964.6031 2972.1393 2981.7754 2988.6192 2994.3976 3007.3218 3041.3115 3057.4502 3067.4480 3092.7678 3095.2900 3099.4600 3112.7060 3114.9993 3125.2729
redmass: 14.3803 6.2574 3.8802 3.3755 4.0943 2.5147 3.2548 3.2500 1.2181 3.7391 1.6656 1.8420 3.4053 2.5821 3.3012 2.4848 2.1641 2.2122 2.8707 3.9213 3.3546 4.6731 4.0902 4.0576 5.9799 7.9409 2.4986 1.6391 3.6714 3.4495 7.6605 3.2120 2.9078 3.0443 2.5786 1.9124 2.3730 1.9144 1.7115 1.9749 2.6978 1.2576 2.0755 2.1357 1.8754 2.7864 2.8996 2.6468 2.1533 3.0108 1.7794 1.3572 2.1640 1.5644 1.2728 1.3451 11.8739 1.5030 2.0946 1.2564 1.2671 1.3323 1.3035 1.1564 1.4543 1.3761 1.5235 1.4378 1.5878 1.3193 1.6419 1.2139 1.2180 4.2925 1.2336 1.0885 1.0897 1.0865 1.0748 1.0575 1.0517 1.0454 6.4446 1.0824 1.0650 1.0693 1.0699 1.0373 1.0800 1.0662 1.0868 1.0353 1.0906 1.0962 1.0980 1.0988 1.0837 1.0998 1.1011 1.0925 1.0946 1.0994
irintensity: 0.2438 2.1676 1.0412 0.4945 0.4586 0.4047 0.3890 3.3135 0.0893 1.0668 0.8531 0.6222 1.7828 1.2852 1.8046 1.4995 13.8216 0.2847 1.1558 0.0344 0.6297 2.4908 2.1363 3.8312 10.9175 8.5863 8.1320 40.9688 15.5642 7.3831 14.5900 9.8718 24.4168 16.7526 34.5143 6.1044 11.2099 9.0052 2.5234 5.4115 26.2811 1.6839 27.0731 4.1480 24.2952 79.2068 65.2207 16.7610 17.8440 7.0205 7.9664 17.0753 19.6871 3.5634 3.4679 0.1512 59.8202 3.5616 2.1429 20.5544 2.4015 2.6833 5.3536 4.9164 0.1557 10.6967 4.9848 9.3283 8.3762 0.3150 0.7701 14.3648 26.2192 155.6458 2.3439 15.3285 5.8652 17.9388 7.4074 5.7586 19.2896 13.9356 5.3363 52.1652 39.7995 13.1957 98.8331 39.6168 7.0325 9.7689 25.7570 18.4797 32.8862 13.6594 52.9583 49.0813 8.0946 13.7189 8.0719 4.9468 4.9228 73.5276
temp: 298.150 k
press: 1.00000 atm
elementType: 8 8 8 8 7 6 6 6 6 6 6 6 6 6 6 6 6 1 1 1 1 1 1 1 1 1 1 1 1 1 1 1 1 1 1 1
symmnumber: 1
zpe: 784095.7 jmol-1
zpe.correction: 0.298646 hartree
zpe.thermalcorrener: 0.315518 hartree
zpe.thermalcorrenthalpy: 0.316462 hartree
zpe.thermalcorrgfe: 0.253620 hartree
zpe.sumelectzpe: -822.870937 hartree
zpe.sumelectthermal: -822.854066 hartree
zpe.sumelectthermalent: -822.853122 hartree
zpe.sumelectthermalfe: -822.915963 hartree
dipole: -0.8964 -5.3561 1.3425
dipole: 5.5941
quadrupole: -94.4640 -102.7555 -106.7209
quadrupole: 12.2797 -3.7236 -0.0148
quadrupole: 6.8495 -1.4420 -5.4075 12.2797 -3.7236 -0.0148
hfenergy: -823.1695833 hartree
pointgroup: C01 [X(C12H19N1O4)]
dipole: -0.3731757 -2.1297081 0.4110842 debye
polarizability: 169.9668976|-2.0769379|140.9460783|-3.8627221|4.0025924|120.4600493 unknown
InChI: InChI=1S/C12H19NO4/c1-9-5-3-4-6-10(9)11-16-7-12(2,8-17-11)13(14)15/h3-4,9-11H,5-8H2,1-2H3
charge 0 multiplicity 1
36 atoms
O  -0.631516 0.001724 1.406667
O  -0.277883 -0.586462 -0.902371
O  -3.214272 1.800978 0.477999
O  -2.874022 1.243476 -1.700315
N  -2.896527 0.969828 -0.446697
C  1.637029 -0.137463 0.545831
C  2.641746 -0.854156 -0.405424
C  0.228607 -0.729063 0.467225
C  1.611441 1.389998 0.270888
C  -2.61327 -0.520039 -0.021301
C  4.070706 -0.307523 -0.143561
C  -1.997319 -0.530103 1.395546
C  -1.624884 -1.149303 -1.028255
C  2.628818 -2.394239 -0.277137
C  3.007054 1.966283 0.1480
C  4.119197 1.203881 -0.01982
C  -3.986941 -1.224095 -0.053242
H  1.977695 -0.300742 1.590293
H  2.354033 -0.587806 -1.442122
H  0.195388 -1.811218 0.741777
H  1.058527 1.899582 1.081543
H  1.034979 1.584583 -0.656329
H  4.738563 -0.635579 -0.966217
H  4.482709 -0.77422 0.778945
H  -2.57531 0.104943 2.081879
H  -2.004849 -1.583385 1.755681
H  -1.605037 -2.245517 -0.836062
H  -1.938838 -0.955109 -2.063681
H  1.686224 -2.833036 -0.651665
H  3.453047 -2.835708 -0.868266
H  2.767373 -2.710987 0.775678
H  3.100819 3.059835 0.203837
H  5.106127 1.683713 -0.078729
H  -4.424227 -1.184604 -1.065942
H  -3.872487 -2.28397 0.23464
H  -4.6885 -0.746398 0.652304
