program: Gaussian 09
title: 000230519
version: EM64L-G09RevD.01
frameworkgroup: C1[X(C10H10Br2O3)]
method: RPBEPBE
basis: SDD
operation: Freq
keyword: #p
keyword: freq=noraman
keyword: PBEPBE/SDD
title: #p freq=noraman PBEPBE/SDD
converged: YES YES NO NO
title: Mulliken charges:
elementType: Br Br O O O C C C C C C C C C C H H H H H H H H H H
charge: -0.051661 0.016444 -0.261024 -0.258385 -0.459512 -0.223286 0.588369 -0.446529 -0.449457 0.198718 -0.464456 0.175624 -0.292719 -0.635918 -0.201961 0.281915 0.313482 0.315329 0.276283 0.241926 0.245811 0.245020 0.242998 0.241895 0.361097
chargesum: 0.00000
title: Mulliken charges with hydrogens summed into heavy atoms:
elementType: Br Br O O O C C C C C C C C C C
charge: -0.051661 0.016444 -0.261024 -0.258385 -0.098415 0.058628 0.588369 -0.133047 -0.134128 0.198718 -0.464456 0.175624 -0.016436 0.096839 0.282932
polarizability: 2.29952236e+02 1.96084994e+01 1.49078195e+02 -1.26706916e+01 4.92288402e+00 8.47085635e+01
1716.lowfreq: -41.5938 -14.7181 -1.5668 -0.0004 -0.0003 0.0007 7.4591 36.8913 43.6043
frequency: -41.5883 36.3739 43.4937 66.5479 100.6795 140.8672 154.7872 185.6871 199.9759 223.8144 251.2699 264.1334 274.3381 285.4969 332.2159 363.2931 388.5994 434.7681 492.4937 506.8638 574.6658 625.5922 640.0673 664.7624 681.0361 711.7749 761.7426 798.4471 835.4615 847.0169 852.3604 907.2291 936.1425 962.4788 977.0795 1004.3821 1062.3826 1064.9188 1071.8992 1115.8616 1119.7707 1136.9169 1183.6163 1190.1851 1231.0254 1256.0887 1282.1054 1324.1269 1359.9891 1366.4244 1381.4424 1391.6842 1416.9020 1460.4798 1461.2470 1469.0176 1486.5025 1601.7193 1621.3000 2988.0945 2990.8523 3019.4013 3081.9067 3090.5357 3099.7392 3117.8736 3194.1787 3197.7262 3521.1360
redmass: 2.2899 8.0910 7.0573 5.5276 9.1726 10.6740 9.1982 6.8945 8.4553 1.3527 2.8847 4.5681 6.2100 3.3969 5.6568 6.8567 1.1799 3.2355 4.7732 5.1208 5.2790 4.2597 6.2899 7.3059 9.9335 4.4271 5.5495 5.6465 6.6636 3.9791 1.4680 1.4031 4.2196 2.1222 5.1642 1.6158 2.3634 1.4539 2.7006 2.6394 1.0366 1.9164 1.2419 1.3088 1.4569 2.6610 1.3147 1.3946 1.5930 1.8011 2.2737 1.2480 4.6999 1.1361 2.5428 1.0562 1.1962 8.8624 9.4100 1.0818 1.0404 1.0534 1.0925 1.0906 1.1192 1.1003 1.0936 1.0930 1.0652
irintensity: 14.2039 0.1229 0.6000 0.3542 0.2551 1.3582 1.7765 2.0196 4.1958 0.5500 0.4067 0.7828 6.4563 2.7337 18.1870 0.0385 162.3921 4.1916 70.3190 15.6929 6.4899 6.9866 13.3316 11.3481 0.6960 0.3230 5.9843 32.9111 20.3680 24.3646 23.7978 30.2506 17.1883 53.2897 157.8294 25.7987 79.2340 4.3998 48.5619 8.6262 0.0284 29.7186 13.1966 51.8757 36.4583 141.2030 10.4450 9.9948 24.9872 46.3297 33.0286 19.8553 10.0754 45.6011 235.2513 5.5271 16.6647 2.8213 7.3249 17.5817 6.6065 124.7344 9.1849 10.3420 28.3876 10.9671 0.9487 6.0252 16.4167
temp: 298.150 k
press: 1.00000 atm
elementType: 35 35 8 8 8 6 6 6 6 6 6 6 6 6 6 1 1 1 1 1 1 1 1 1 1
symmnumber: 1
zpe: 471825.0 jmol-1
zpe.correction: 0.179709 hartree
zpe.thermalcorrener: 0.194079 hartree
zpe.thermalcorrenthalpy: 0.195024 hartree
zpe.thermalcorrgfe: 0.136056 hartree
zpe.sumelectzpe: -638.508016 hartree
zpe.sumelectthermal: -638.493646 hartree
zpe.sumelectthermalent: -638.492701 hartree
zpe.sumelectthermalfe: -638.551669 hartree
dipole: -2.5718 -0.8593 1.2070
dipole: 2.9681
quadrupole: -97.9512 -107.8989 -106.7490
quadrupole: 3.6814 -2.5286 -1.9304
quadrupole: 6.2485 -3.6992 -2.5493 3.6814 -2.5286 -1.9304
hfenergy: -638.6877251 hartree
pointgroup: C01 [X(C10H10Br2O3)]
dipole: 1.0144991 -0.3893874 -0.4274828 debye
dipolederiv: -0.8818538 -0.0119693 0.0718758 -0.0188737 -0.1697763 -0.0125062 0.0892411 -0.0264226 -0.256577 -0.2334819 0.2434166 -0.0249495 0.22333 -0.4600002 0.0529457 -0.0399883 0.060802 -0.0371975 -1.3039659 0.42967 0.0257904 0.5556483 -0.6459285 0.0421984 0.0228715 0.0478916 -0.2660444 -1.5026744 0.3319685 0.0709707 0.3040433 -0.5045105 0.0353779 0.1344772 0.0207295 -0.2693631 -0.3770916 -0.1457076 -0.0189837 -0.1727294 -0.5675157 0.0963329 0.0351722 0.1152741 -0.7362686 0.2038788 0.1552958 -0.0626462 0.1922282 0.4245226 -0.1143817 0.0890969 -0.1379442 0.464152 -0.1158529 0.1379288 0.0183134 0.127372 -0.2324416 0.0471125 -0.1575292 0.0147776 -0.0740659 1.2081164 -0.0017735 -0.2116687 -0.0839504 0.0833501 0.0702335 -0.128993 0.1522375 0.1224665 -0.0834865 0.0470093 -0.0450576 -0.0591815 -0.0576757 -0.0217798 -0.0667966 -0.0585239 -0.0982827 0.5846436 -0.4456843 0.0444693 -1.0361683 0.52209 -0.0015703 0.2277652 -0.0734396 0.0388169 0.2992284 -0.4214866 0.0034869 -0.3901288 0.7632196 -0.140064 0.013021 -0.1764671 -0.1271903 1.2830738 -0.2637105 -0.1012497 0.2010993 -0.0504376 0.0047173 -0.2864563 0.076202 0.0615935 -0.2518111 0.061751 0.0016031 0.2610889 -0.1610998 -0.0299394 -0.0354431 0.0129179 -0.0896416 -0.1972979 0.0795925 0.082829 -0.0338721 -0.0495721 -0.063221 -0.0128282 -0.1440248 -0.0761453 1.1943083 -0.2593359 -0.0097975 -0.2943989 0.6323727 0.0149744 -0.0125342 0.0238412 0.5599808 -0.0144584 0.0293896 0.0397 0.0200572 -0.075527 -0.0332599 0.0012521 -0.0395304 -0.003688 -0.0390336 -0.0045725 0.0522977 0.035824 -0.0138479 0.0432246 0.0434905 0.0392351 0.0130531 0.1719562 0.0178736 0.0057179 -0.0068906 0.0458372 0.0260139 -0.0021874 0.0264665 0.1656787 0.0877404 -0.0286453 0.0233729 -0.035134 0.0386776 0.0454333 0.0296045 0.0449587 0.1604926 -0.0959456 -0.0078471 0.087073 0.0481339 0.057753 -0.0173093 0.1249349 0.0184855 0.0846984 0.1157136 -0.0002104 0.0067442 0.0071039 -0.0202177 0.0490604 0.0328618 0.1298218 0.0464828 0.0187883 -0.0374747 -0.1225255 -0.0012404 0.0840089 -0.0212767 -0.1098159 -0.0379017 -0.0312146 -0.1223032 0.0489176 -0.0690062 0.019825 0.056404 -0.0133211 -0.1644382 0.0219125 -0.0418993 -0.0530573 0.0596596 0.0369691 0.1000526 0.0056524 -0.0617395 0.1329228 -0.0986162 -0.0577811 0.1048665 -0.0140551 0.0946711 0.0367614 0.2946624 0.0027442 0.0402987 -0.012683 0.447944 unknown
polarizability: 230.08109|-20.8252545|147.1392975|-9.5027331|-12.1591994|86.5186074 unknown
InChI: InChI=1S/C10H10Br2O3/c1-5(11)10(13)6-2-8-9(3-7(6)12)15-4-14-8/h2-3,5,10,13H,4H2,1H3
charge 0 multiplicity 1
25 atoms
Br -4.827988 -0.257301 -0.095704
Br -1.133877 2.993381 -0.314157
O  2.728419 -1.725712 0.341556
O  3.595646 0.374387 -0.449265
O  -2.145665 -1.159352 1.559494
C  -2.016444 -0.002323 0.6747
C  -0.53105 0.176249 0.366746
C  -2.824504 -0.20219 -0.640792
C  0.343998 -0.938542 0.540711
C  1.691779 -0.76708 0.239626
C  0.010119 1.402354 -0.093169
C  2.204652 0.463186 -0.22365
C  1.38609 1.579329 -0.399376
C  -2.500237 -1.465377 -1.434401
C  3.968483 -1.023684 -0.084729
H  -2.403446 0.910022 1.171761
H  -2.783302 0.709887 -1.256478
H  -0.061756 -1.874142 0.928772
H  1.781936 2.535211 -0.746168
H  -1.464057 -1.398977 -1.817406
H  -2.575807 -2.364294 -0.800371
H  -3.179652 -1.574617 -2.295039
H  4.675995 -0.994568 0.76126
H  4.379109 -1.526594 -0.976456
H  -3.111844 -1.283354 1.753335
