program: Gaussian 09
title: 000230518
version: EM64L-G09RevD.01
frameworkgroup: C1[X(C15H14O2)]
method: RPBEPBE
basis: SDD
operation: Freq
keyword: #pfreq=noraman
keyword: PBEPBE/SDD
title: #p freq=noraman PBEPBE/SDD
converged: NO YES NO NO
title: Mulliken charges:
elementType: O O C C C C C C C C C C C C C C C H H H H H H H H H H H H H H
charge: -0.287342 -0.262254 0.473669 0.220883 -0.425473 0.447146 -0.343569 -0.332706 -0.378980 -0.374925 0.191528 -0.386093 -0.386418 -0.804425 -0.224978 -0.224969 -0.232113 0.233399 0.233476 0.267743 0.274064 0.234696 0.233524 0.235392 0.235334 0.228000 0.228057 0.239871 0.228443 0.228434 0.230586
chargesum: 0.00000
title: Mulliken charges with hydrogens summed into heavy atoms:
elementType: O O C C C C C C C C C C C C C C C
charge: -0.287342 -0.262254 0.473669 0.220883 0.041402 0.447146 -0.075826 -0.058642 -0.144285 -0.141401 0.191528 -0.150702 -0.151084 -0.108496 0.003464 0.003465 -0.001527
polarizability: 2.33913623e+02 1.16343586e+01 1.58815559e+02 6.22121246e-01 -1.91981828e-01 1.16282383e+02
1716.lowfreq: -6.5918 -4.7830 -2.9172 -0.0009 -0.0006 -0.0003 2.6407 18.2957 26.3119
frequency: -6.3252 17.9077 26.0607 41.1936 57.3978 85.4348 126.2908 147.6439 218.6100 240.8145 284.0634 322.9272 335.7020 339.9341 402.8332 406.8781 452.5131 478.7698 518.9144 564.0625 602.8348 617.2871 633.7825 678.9747 702.0378 738.9582 751.8202 760.0347 802.4421 846.3532 853.5203 858.6843 861.8768 880.7747 932.4898 946.3069 977.1158 983.3082 986.8180 991.0258 995.4324 997.3609 1009.8047 1026.7868 1046.7449 1051.2386 1088.6209 1122.0250 1173.2450 1184.6481 1188.2617 1190.7550 1223.2671 1227.7623 1242.6942 1306.3949 1325.2736 1353.6606 1376.9710 1386.0083 1395.4933 1410.3547 1440.4881 1469.3179 1470.5551 1473.6786 1487.4780 1501.7659 1575.0934 1596.3365 1614.1201 1618.1501 1621.5522 2977.0897 3013.4110 3059.3371 3076.4691 3090.0083 3122.6828 3125.1029 3126.5635 3129.1750 3136.7268 3149.7590 3159.1656 3165.5038 3173.2340
redmass: 3.9549 3.6823 1.0585 4.7848 4.5785 5.2918 5.0387 4.7186 6.0856 5.5200 4.6014 2.1644 5.7501 3.0760 2.7960 2.8609 4.4608 2.8842 4.7460 4.8381 5.4022 6.3358 6.9527 4.5477 1.8132 3.0762 3.2154 2.5965 5.3482 1.5466 1.2480 3.9744 1.2480 5.9759 1.6499 1.6307 1.3926 1.3383 1.4249 6.0075 1.3754 1.3305 3.5706 2.1752 1.7065 3.6870 1.5161 1.3052 1.0540 1.1462 1.1183 1.0898 3.0226 2.3774 3.2590 1.2811 1.2748 1.5300 5.0806 8.8022 1.2215 3.5055 2.1963 1.1050 1.0968 1.0562 2.4309 2.6904 6.8009 6.1432 10.1802 6.4373 6.3352 1.0390 1.0578 1.0942 1.1075 1.1000 1.0851 1.0883 1.0893 1.0898 1.0921 1.0964 1.0954 1.1017 1.0951
irintensity: 0.0688 0.4239 0.6857 0.2813 1.8344 0.0603 0.6736 0.8794 4.0897 8.0218 4.0089 1.5516 1.4503 2.1555 0.0003 0.0071 2.4070 10.8245 18.1759 10.5248 3.4726 0.1281 1.8579 19.8999 52.0325 20.1959 32.4274 38.7969 0.3905 34.4371 0.1690 23.4195 0.3981 56.8277 1.1079 2.0699 0.0484 3.0312 9.1166 1.6120 0.5166 0.3228 87.0508 7.1572 89.9759 286.7117 7.2445 6.9972 0.0006 95.0402 6.8459 1.5269 1.0147 15.9368 363.6507 1.4760 0.2397 13.8608 4.0700 0.3244 13.1606 9.7188 9.2348 15.4885 6.0811 13.0590 6.5682 14.5468 33.7571 0.6789 184.8318 20.1564 69.4489 27.8186 20.8664 21.6736 12.9024 16.4110 4.3970 1.8967 16.8002 15.1755 15.8603 40.0685 9.0821 20.5730 2.4802
temp: 298.150 k
press: 1.00000 atm
elementType: 8 8 6 6 6 6 6 6 6 6 6 6 6 6 6 6 6 1 1 1 1 1 1 1 1 1 1 1 1 1 1
symmnumber: 1
zpe: 647000.1 jmol-1
zpe.correction: 0.246429 hartree
zpe.thermalcorrener: 0.261024 hartree
zpe.thermalcorrenthalpy: 0.261968 hartree
zpe.thermalcorrgfe: 0.201674 hartree
zpe.sumelectzpe: -729.253827 hartree
zpe.sumelectthermal: -729.239233 hartree
zpe.sumelectthermalent: -729.238288 hartree
zpe.sumelectthermalfe: -729.298583 hartree
dipole: 0.1827 -2.6860 0.0625
dipole: 2.6929
quadrupole: -76.8674 -101.8046 -95.4971
quadrupole: -1.0435 0.3723 -0.1077
quadrupole: 14.5223 -10.4149 -4.1074 -1.0435 0.3723 -0.1077
hfenergy: -729.5002566 hartree
pointgroup: C01 [X(C15H14O2)]
dipole: -0.0499617 -1.0580324 -0.0234362 debye
polarizability: 234.364926|-10.0656097|158.3655654|0.5355251|0.1678323|116.2810744 unknown
InChI: InChI=1S/C15H14O2/c1-12-7-9-14(10-8-12)15(16)17-11-13-5-3-2-4-6-13/h2-10H,11H2,1H3
charge 0 multiplicity 1
31 atoms
O  0.457887 0.631182 0.001903
O  -0.727458 2.641033 -0.005167
C  2.880305 0.467256 -0.002095
C  -1.937141 0.51725 0.004199
C  1.726127 1.437898 -0.001722
C  -4.315224 -1.0587 0.015153
C  -3.211051 1.142049 0.003623
C  -1.855464 -0.899301 0.012835
C  -4.382053 0.360548 0.010642
C  -3.033708 -1.671751 0.019863
C  -0.726064 1.382918 -0.000108
C  3.430547 0.002703 1.219204
C  3.428347 0.001209 -1.223808
C  -5.579616 -1.897626 -0.009159
C  4.504869 -0.914368 1.220999
C  4.502696 -0.915832 -1.226437
C  5.043129 -1.376115 -0.002926
H  1.715582 2.087063 0.891952
H  1.712584 2.084144 -0.897449
H  -3.258269 2.236161 0.001491
H  -0.871311 -1.376199 0.01777
H  -5.361942 0.85273 0.014097
H  -2.962328 -2.765997 0.030436
H  3.013262 0.35906 2.168827
H  3.009341 0.356418 -2.173103
H  -5.431617 -2.869482 0.49312
H  -6.42036 -1.378721 0.483475
H  -5.890282 -2.1104 -1.0508
H  4.922735 -1.265569 2.170971
H  4.918873 -1.26815 -2.176737
H  5.878606 -2.08521 -0.003247
