program: Gaussian 09
title: 000230495
version: EM64L-G09RevD.01
frameworkgroup: C1[X(C18H17NO2)]
method: RPBEPBE
basis: SDD
operation: Freq
keyword: #p
keyword: freq=noraman
keyword: PBEPBE/SDD
title: #p freq=noraman PBEPBE/SDD
converged: YES YES NO NO
title: Mulliken charges:
elementType: O O N C C C C C C C C C C C C C C C C C C H H H H H H H H H H H H H H H H H
charge: -0.473097 -0.265145 -0.025824 0.022545 0.075917 0.410765 -0.740787 -0.319084 -0.129840 0.470478 -0.317245 -0.387989 -0.409264 -0.537128 -0.340013 -0.238069 -0.219504 0.316694 -0.342666 -0.245727 -0.536859 0.204506 0.253036 0.237052 0.276190 0.244040 0.259643 0.285823 0.344743 0.258446 0.259801 0.222744 0.222541 0.246114 0.224873 0.247571 0.222560 0.222157
chargesum: 0.00000
title: Mulliken charges with hydrogens summed into heavy atoms:
elementType: O O N C C C C C C C C C C C C C C C C C C
charge: -0.128354 -0.265145 -0.025824 0.022545 0.075917 0.410765 -0.046193 -0.042894 -0.129840 0.470478 -0.073205 -0.128346 -0.123441 -0.278682 -0.080212 -0.015324 0.003038 0.316694 -0.096553 -0.020853 0.155429
polarizability: 3.24422087e+02 -2.00694531e+01 1.66640790e+02 -2.08350966e+01 1.53365340e+01 1.64457469e+02
1716.lowfreq: -6.3637 -0.0010 -0.0008 0.0003 2.6000 4.4791 19.7773 32.4519 37.9889
frequency: 19.4288 32.4506 37.9527 69.5441 104.4472 126.5249 156.6807 178.5222 200.6737 218.6672 225.1399 233.4924 250.2821 282.9660 285.0585 314.9300 329.9870 364.4822 384.2806 403.9276 412.5737 424.6905 472.1985 479.4114 502.9761 520.6266 547.8490 551.7233 597.6241 614.0641 616.4723 656.3831 701.3550 709.0017 714.9455 763.0041 773.2098 789.4784 812.4966 830.2675 838.7271 860.3980 878.5858 895.2775 906.0574 933.7353 938.0744 963.6221 984.6016 989.7203 990.7219 998.3408 999.7433 1023.5513 1047.4715 1062.9626 1079.0168 1104.2616 1111.0435 1127.9850 1136.7131 1152.6751 1158.5450 1170.8770 1173.5745 1188.6303 1226.4384 1253.5019 1267.9609 1288.7578 1302.7309 1325.7123 1357.7281 1380.6161 1382.8536 1391.6942 1413.4449 1433.7095 1437.2508 1452.2593 1461.8574 1469.7930 1470.2974 1475.7896 1481.0925 1498.6035 1545.8314 1591.4240 1591.8951 1611.6052 1634.1414 2962.1997 2987.2897 3051.1828 3084.6622 3118.9842 3120.9792 3126.5135 3127.6188 3132.2520 3140.3228 3149.0354 3150.0991 3157.3331 3170.8556 3176.9170 3179.4827 3562.9745
redmass: 4.3112 4.7338 4.2599 3.7642 4.3646 4.4516 3.7942 3.5999 2.4668 3.0865 1.3415 3.2368 1.5157 2.4482 3.2737 1.3451 3.9810 4.4260 4.0790 2.8750 3.8704 5.8550 3.7390 3.1596 4.7802 6.0696 4.0671 4.7817 3.2292 4.9385 6.3505 5.7445 3.6912 1.8683 5.7036 3.6395 2.1653 2.2258 2.8393 1.8668 1.7421 1.2494 3.3378 1.7171 3.8962 1.4290 3.6499 1.3463 1.3800 5.8852 1.3444 1.3116 4.0613 2.3881 1.6729 2.3890 2.0085 2.0727 1.2573 1.7341 1.4092 1.9038 1.2439 1.0622 1.6563 1.1549 2.3348 1.7966 6.0034 2.5866 1.7020 1.4726 3.9601 1.8974 2.4792 2.7374 7.3102 2.1736 1.2539 1.0737 1.3739 1.3032 1.1068 1.3291 2.1317 3.9397 7.0926 6.3576 6.7551 6.0463 7.0430 1.0329 1.0384 1.1041 1.0965 1.0857 1.0987 1.0994 1.0887 1.0902 1.0942 1.0887 1.0905 1.0993 1.0968 1.0956 1.0948 1.0658
irintensity: 0.0692 0.3478 0.2896 3.5743 4.3893 0.6774 3.5578 3.6709 1.5511 8.4208 0.8349 0.4988 0.4541 23.4588 4.3811 155.2217 3.5761 12.3655 2.5315 0.5568 2.3224 2.4319 3.9915 5.9105 0.5817 6.6824 38.2707 10.9746 6.4521 6.4484 0.3577 1.0886 8.7588 54.1570 12.6397 6.0268 35.5100 3.0063 12.0793 24.0648 28.9652 0.1475 31.9982 49.0071 5.1048 6.2266 1.4883 1.7131 0.1604 0.5519 0.5360 1.2331 64.6649 22.3783 28.8443 29.5318 51.9363 47.2598 0.2342 15.6688 6.1889 31.2996 51.2587 1.4983 82.2860 6.2950 35.9598 65.4467 135.3150 1.9983 7.3020 20.2776 11.0861 14.3182 13.5947 0.1305 1.1662 15.3856 10.9321 7.7218 19.2223 18.6665 15.4909 32.1872 32.0463 98.8140 61.3488 0.3461 43.3222 6.3502 87.7938 84.4876 26.8410 46.9536 40.2263 1.1161 13.0363 26.1288 4.9013 10.3056 30.4572 7.8096 2.4781 33.5222 14.0112 3.6119 8.4791 11.6717
temp: 298.150 k
press: 1.00000 atm
elementType: 8 8 7 6 6 6 6 6 6 6 6 6 6 6 6 6 6 6 6 6 6 1 1 1 1 1 1 1 1 1 1 1 1 1 1 1 1 1
symmnumber: 1
zpe: 792947.0 jmol-1
zpe.correction: 0.302018 hartree
zpe.thermalcorrener: 0.320488 hartree
zpe.thermalcorrenthalpy: 0.321432 hartree
zpe.thermalcorrgfe: 0.254592 hartree
zpe.sumelectzpe: -899.819964 hartree
zpe.sumelectthermal: -899.801494 hartree
zpe.sumelectthermalent: -899.800549 hartree
zpe.sumelectthermalfe: -899.867390 hartree
dipole: -3.3090 0.1458 0.8985
dipole: 3.4319
quadrupole: -104.9772 -114.4895 -119.6567
quadrupole: -6.1074 -8.3219 2.6250
quadrupole: 8.0639 -1.4483 -6.6156 -6.1074 -8.3219 2.6250
hfenergy: -900.1219819 hartree
pointgroup: C01 [X(C18H17N1O2)]
dipole: 1.303217 -0.1473122 -0.3209567 debye
polarizability: 323.3777971|6.9492269|150.7698868|-30.6367281|-4.1645315|181.372662 unknown
InChI: InChI=1S/C18H17NO2/c1-18(20,14-6-4-3-5-7-14)17-11-8-13-12-15(21-2)9-10-16(13)19-17/h3-12,20H,1-2H3
charge 0 multiplicity 1
38 atoms
O  -2.609212 -1.844481 1.580593
O  5.510065 0.953285 0.219234
N  0.247595 -0.944358 -0.49231
C  -2.072655 -1.336667 0.293056
C  -0.629511 -0.836143 0.524082
C  -2.977159 -0.157689 -0.115644
C  -2.130546 -2.46073 -0.765146
C  -0.284425 -0.246015 1.791093
C  1.540534 -0.472067 -0.303193
C  1.97827 0.132991 0.940217
C  1.005912 0.23414 1.99375
C  -2.62297 0.636725 -1.236003
C  -4.172716 0.127527 0.585756
C  3.319027 0.59464 1.06655
C  2.475752 -0.586361 -1.376084
C  -3.456689 1.697172 -1.651623
C  -5.005062 1.192288 0.168973
C  4.213233 0.467666 -0.006192
C  3.788794 -0.128303 -1.240054
C  -4.652891 1.979552 -0.9505
C  6.485442 0.845782 -0.869044
H  -1.492229 -3.313238 -0.464018
H  -1.75655 -2.102298 -1.736255
H  -3.173735 -2.802519 -0.874013
H  -1.054043 -0.185807 2.564711
H  1.290317 0.692644 2.948043
H  -1.689524 0.430582 -1.772917
H  -4.436861 -0.487753 1.449452
H  -2.137022 -2.688997 1.793881
H  3.668355 1.053912 1.997247
H  2.129725 -1.04595 -2.307108
H  -3.17204 2.304838 -2.518265
H  -5.928993 1.405005 0.719284
H  4.484468 -0.228678 -2.078327
H  -5.299391 2.804118 -1.27208
H  7.409759 1.284621 -0.465909
H  6.161919 1.416703 -1.760829
H  6.666856 -0.210441 -1.147407
