program: Gaussian 09
title: 000230484
version: EM64L-G09RevD.01
frameworkgroup: C1[X(C12H12NO2P)]
method: RPBEPBE
basis: SDD
operation: Freq
keyword: #p
keyword: freq=noraman
keyword: PBEPBE/SDD
title: #p freq=noraman PBEPBE/SDD
converged: YES YES NO NO
title: Mulliken charges:
elementType: P O O N C C C C C C C C C C C C H H H H H H H H H H H H
charge: 1.243539 -0.564298 -0.608380 -0.920472 -0.168979 -0.259287 -0.264820 0.375936 -0.214774 -0.213285 -0.219716 -0.387113 -0.342531 -0.195803 -0.206069 -0.252080 0.286680 0.264298 0.361815 0.342248 0.237432 0.237129 0.235504 0.248013 0.303384 0.226611 0.227582 0.227433
chargesum: 0.00000
title: Mulliken charges with hydrogens summed into heavy atoms:
elementType: P O O N C C C C C C C C C C C C
charge: 1.243539 -0.564298 -0.608380 -0.216409 -0.168979 0.027393 -0.000522 0.375936 0.022658 0.023844 0.015788 -0.139100 -0.039146 0.030808 0.021513 -0.024647
polarizability: 2.35724640e+02 3.68546739e+00 1.45970901e+02 5.99253764e+00 7.07698960e+00 1.03264688e+02
1716.lowfreq: -7.5682 -4.2246 -0.0004 0.0006 0.0015 6.6673 16.4215 27.0482 41.6384
frequency: 13.8840 26.8166 41.4808 68.9305 112.2197 139.4367 176.0663 217.4971 228.8698 250.9806 288.0326 311.0267 354.6944 396.8708 409.0314 413.6347 450.2810 482.4120 494.4440 504.5860 546.7504 605.4518 612.2173 640.2936 689.9524 695.3971 699.2973 760.9446 764.7247 820.1292 826.4674 841.4967 861.5537 915.8771 926.3718 938.3638 971.3076 984.9567 985.7193 988.0098 990.4012 1006.6485 1018.7072 1021.4267 1044.2895 1076.2345 1080.8696 1104.0315 1163.8492 1171.8684 1176.1403 1189.9317 1195.0518 1310.0641 1312.5456 1379.1587 1380.6543 1428.4273 1440.8170 1466.5157 1471.8152 1558.9551 1587.1894 1591.4728 1597.9449 1603.2117 3127.2456 3132.0573 3137.1897 3141.0893 3153.0473 3154.5624 3163.8500 3166.4638 3171.2308 3180.0908 3526.5835 3677.5695
redmass: 3.9585 4.6216 5.0573 5.8183 4.3826 6.1742 3.8814 4.7177 4.8644 3.6808 5.6568 4.7304 1.6504 3.1993 3.0042 3.3236 2.7200 3.3978 2.8491 2.3685 5.3514 6.6551 6.4579 7.3810 6.3987 2.2167 2.1466 1.5561 1.5651 6.0457 6.3461 1.2658 1.2463 1.4164 1.6852 1.3811 1.3649 4.0050 1.8270 3.4374 1.3788 1.3227 3.2059 2.1639 3.2047 1.5374 1.6130 3.1336 1.2617 1.2765 1.0553 1.2318 1.7142 1.3316 1.3154 8.3747 9.0851 2.1225 2.2951 2.0614 2.2311 1.1076 5.9930 6.4706 5.8928 6.2283 1.0848 1.0855 1.0896 1.0892 1.0939 1.0935 1.0961 1.0986 1.1008 1.0976 1.0442 1.1026
irintensity: 0.2187 0.8584 0.4157 2.6440 8.8358 2.2874 3.5237 9.6833 0.3913 3.3987 3.3193 4.3884 7.7669 3.7245 14.2977 16.9573 13.3698 50.3094 48.8846 273.9626 11.2916 41.6488 3.1845 124.6096 77.1848 29.2844 38.7899 42.0546 98.3595 162.3528 181.1996 7.9870 1.0191 11.1631 33.3011 4.7559 0.8395 1.7521 0.0872 0.9357 1.7040 0.1476 21.4856 18.7807 76.2931 12.7472 5.3185 70.6615 61.0239 69.1631 0.0290 61.7794 109.4273 0.8246 1.9113 2.3996 0.8506 19.1661 5.9658 16.8481 140.0809 61.1098 4.3798 22.9855 0.4728 67.1043 0.5301 0.1632 18.2707 3.3536 16.9982 23.6191 9.6088 22.8325 16.6024 10.4330 41.5231 37.9025
temp: 298.150 k
press: 1.00000 atm
elementType: 15 8 8 7 6 6 6 6 6 6 6 6 6 6 6 6 1 1 1 1 1 1 1 1 1 1 1 1
symmnumber: 1
zpe: 559587.2 jmol-1
zpe.correction: 0.213136 hartree
zpe.thermalcorrener: 0.228144 hartree
zpe.thermalcorrenthalpy: 0.229089 hartree
zpe.thermalcorrgfe: 0.168595 hartree
zpe.sumelectzpe: -1009.755346 hartree
zpe.sumelectthermal: -1009.740337 hartree
zpe.sumelectthermalent: -1009.739393 hartree
zpe.sumelectthermalfe: -1009.799887 hartree
dipole: 1.9511 1.4874 3.5221
dipole: 4.2923
quadrupole: -80.4109 -98.4859 -100.6100
quadrupole: 2.7379 1.1804 -6.6389
quadrupole: 12.7580 -5.3169 -7.4411 2.7379 1.1804 -6.6389
hfenergy: -1009.9684815 hartree
pointgroup: C01 [X(C12H12N1O2P1)]
dipole: 0.8432809 -1.2738028 0.7197893 debye
polarizability: 232.6515909|10.7623517|103.5560616|15.5728349|-4.5676624|148.7525757 unknown
InChI: InChI=1S/C12H12NO2P/c13-16(14,12-9-5-2-6-10-12)15-11-7-3-1-4-8-11/h1-10H,13H2
charge 0 multiplicity 1
28 atoms
P  0.661907 0.306025 -0.976848
O  -0.542063 0.175096 0.324283
O  0.301662 1.372486 -2.112898
N  0.852425 -1.254506 -1.676454
C  2.136329 0.558392 0.111634
C  2.000525 1.029104 1.438486
C  3.417625 0.334715 -0.448991
C  -1.933721 0.050157 0.077619
C  3.159504 1.267984 2.21009
C  4.570618 0.576235 0.329605
C  4.442242 1.043694 1.658437
C  -2.643329 -0.817862 0.938929
C  -2.59986 0.787762 -0.931197
C  -4.041736 -0.948101 0.791165
C  -3.99789 0.634035 -1.072426
C  -4.724225 -0.22682 -0.217132
H  1.003204 1.192817 1.855448
H  3.510862 -0.025818 -1.479312
H  0.458644 -1.417253 -2.602943
H  1.133497 -2.068939 -1.131301
H  3.059745 1.629826 3.238956
H  5.562948 0.404178 -0.100504
H  5.337897 1.23306 2.26044
H  -2.094832 -1.368547 1.709544
H  -2.030893 1.459948 -1.581155
H  -4.595195 -1.615472 1.46137
H  -4.520132 1.200304 -1.851902
H  -5.808459 -0.331902 -0.331642
