program: Gaussian 09
title: 000230472
version: EM64L-G09RevD.01
frameworkgroup: C1[X(C17H16O2)]
method: RPBEPBE
basis: SDD
operation: Freq
keyword: #pfreq=noraman
keyword: PBEPBE/SDD
title: #p freq=noraman PBEPBE/SDD
converged: YES YES NO NO
title: Mulliken charges:
elementType: O O C C C C C C C C C C C C C C C C C H H H H H H H H H H H H H H H H
charge: -0.319301 -0.221969 0.102803 0.338377 0.352370 -0.411788 -0.409171 -0.227655 -0.801011 -0.820429 0.474070 0.180632 -0.236811 -0.350557 -0.364906 -0.381037 -0.235944 -0.233630 -0.231277 0.233829 0.233104 0.224462 0.241543 0.241508 0.219844 0.267106 0.222738 0.233858 0.258216 0.253354 0.231818 0.237520 0.231115 0.232915 0.234303
chargesum: 0.00000
title: Mulliken charges with hydrogens summed into heavy atoms:
elementType: O O C C C C C C C C C C C C C C C C C
charge: -0.319301 -0.221969 0.102803 0.338377 0.352370 -0.177959 -0.176067 -0.003192 -0.098116 -0.096728 0.474070 0.180632 0.021405 -0.097202 -0.133088 -0.143518 -0.004829 -0.000715 0.003026
polarizability: 3.52361268e+02 2.12531583e+00 1.54922449e+02 -5.04288911e+00 -1.23310466e+01 1.28378246e+02
1716.lowfreq: -2.4225 -0.0005 -0.0002 0.0004 4.3355 8.2151 24.3869 25.7001 43.1900
frequency: 24.3517 25.6062 43.1809 54.7639 92.0570 94.2252 108.4080 133.7875 154.3761 158.4997 197.9233 224.9645 240.5078 279.1993 285.3178 304.8109 310.7649 403.2992 440.2576 469.0828 490.5397 512.3233 515.7947 525.6268 541.1872 570.2916 615.1148 664.8556 668.7818 684.3347 697.7354 757.8254 774.9464 777.3066 788.2968 844.6954 848.6549 891.1651 895.5490 920.3918 930.0589 936.6513 973.0198 981.6474 986.0072 988.8085 998.7290 1015.1508 1025.7781 1043.0377 1046.9883 1049.9108 1083.4346 1086.6446 1093.0888 1146.9788 1175.0206 1176.6447 1192.0652 1218.9284 1260.4302 1277.0892 1299.5210 1304.0896 1337.6176 1375.4073 1387.7504 1397.0788 1399.8145 1430.7234 1440.6931 1455.7710 1462.8865 1464.0545 1483.5375 1486.0194 1488.5624 1582.0218 1596.8448 1608.3948 1614.8869 1626.5179 1647.9373 2981.2508 2982.2890 3062.0628 3062.8951 3090.9284 3092.2546 3099.2371 3123.0221 3125.5491 3131.1196 3133.5514 3142.9091 3153.9988 3157.6545 3163.1032 3168.8740
redmass: 3.6943 5.0857 5.2470 4.9894 3.9887 5.7839 1.0492 1.8047 1.7071 2.6466 4.8970 2.9422 5.8292 2.9066 3.5702 3.7779 4.3508 2.7581 4.8857 3.3829 2.9325 3.3706 4.0200 5.3968 5.1672 5.8673 6.4329 5.2756 5.8368 4.7601 1.6687 5.2883 1.9197 1.3584 4.2573 4.9070 1.2790 1.8006 1.3118 2.5384 1.4578 5.6315 1.3385 1.3882 1.6292 6.0958 1.3108 1.2067 2.2185 1.8171 1.5400 1.5352 1.7380 1.9517 3.2697 3.5573 1.0663 1.1653 1.1315 1.6172 1.5604 3.1619 2.0084 1.5929 1.2738 6.5925 6.8665 1.2533 1.2466 2.4456 2.2850 1.8927 1.0534 1.0771 1.3122 2.2214 1.2187 5.6576 5.6726 6.2914 8.0329 10.0053 5.8643 1.0367 1.0373 1.0964 1.0975 1.0995 1.0999 1.0900 1.0856 1.0867 1.0869 1.0921 1.0916 1.0965 1.0994 1.0916 1.1015
irintensity: 0.0729 0.6597 0.3831 0.3013 0.1619 0.2825 0.5317 3.4816 1.1959 0.1264 3.9563 0.2386 3.2389 0.5278 3.7019 3.6654 3.0580 0.0205 9.6372 0.7028 13.8432 0.9725 2.6854 11.5847 0.5878 16.1562 0.2296 3.4679 0.3376 2.1804 43.0430 0.5648 60.6071 50.8932 25.0704 20.2239 0.3767 10.2108 0.0648 4.5563 0.0612 93.7553 0.9165 0.2752 13.0016 4.6125 6.2426 38.3706 0.9599 4.2105 8.7015 3.5969 179.3668 182.8090 565.8921 62.7145 2.2423 1.4427 13.3595 34.8814 0.2963 15.6739 30.1554 77.5369 19.0353 3.6530 16.8474 12.8117 7.6159 10.4666 16.5729 0.4269 34.1285 3.0100 44.3912 12.6407 53.8634 9.9151 7.4075 73.2953 6.8096 269.2249 123.9281 30.7444 16.0429 15.6323 12.3964 25.3853 31.0594 2.0482 0.0622 4.9295 0.4698 24.7932 10.0197 32.5327 39.6639 6.6909 30.1797
temp: 298.150 k
press: 1.00000 atm
elementType: 8 8 6 6 6 6 6 6 6 6 6 6 6 6 6 6 6 6 6 1 1 1 1 1 1 1 1 1 1 1 1 1 1 1 1
symmnumber: 1
zpe: 731383.3 jmol-1
zpe.correction: 0.278569 hartree
zpe.thermalcorrener: 0.296407 hartree
zpe.thermalcorrenthalpy: 0.297352 hartree
zpe.thermalcorrgfe: 0.230650 hartree
zpe.sumelectzpe: -806.515676 hartree
zpe.sumelectthermal: -806.497838 hartree
zpe.sumelectthermalent: -806.496894 hartree
zpe.sumelectthermalfe: -806.563596 hartree
dipole: 2.6424 0.7912 -1.2809
dipole: 3.0413
quadrupole: -85.7107 -106.6333 -113.3249
quadrupole: -0.3389 0.1938 -0.4680
quadrupole: 16.1789 -4.7437 -11.4353 -0.3389 0.1938 -0.4680
hfenergy: -806.7942455 hartree
pointgroup: C01 [X(C17H16O2)]
dipole: -1.0382176 -0.0365467 0.593669 debye
polarizability: 352.3069435|2.9088083|134.9772943|-5.8892622|16.7796953|148.3777249 unknown
InChI: InChI=1S/C17H16O2/c1-13-7-6-8-14(2)17(13)19-16(18)12-11-15-9-4-3-5-10-15/h3-12H,1-2H3
charge 0 multiplicity 1
35 atoms
O  1.336013 -0.031426 0.610773
O  0.675893 0.045531 -1.649649
C  2.737749 -0.010672 0.286509
C  3.447003 1.170505 0.614834
C  3.351839 -1.172815 -0.240841
C  4.845991 1.17164 0.393702
C  4.753414 -1.124976 -0.446887
C  5.495964 0.03466 -0.135484
C  2.726114 2.382943 1.170186
C  2.546092 -2.412508 -0.570932
C  -3.492759 -0.018897 -0.218659
C  0.372249 0.00086 -0.435048
C  -2.087644 -0.001875 -0.643438
C  -0.977573 -0.026268 0.157396
C  -3.893777 -0.062549 1.149454
C  -4.506381 0.010295 -1.219959
C  -5.257708 -0.075903 1.496905
C  -5.872831 -0.003141 -0.871868
C  -6.253968 -0.046238 0.489081
H  5.4221 2.071718 0.637601
H  5.259039 -2.008493 -0.853575
H  6.578951 0.050965 -0.300196
H  2.122565 2.120539 2.057402
H  2.028964 2.810102 0.424787
H  3.444446 3.170327 1.454615
H  1.941225 -2.251242 -1.482649
H  3.207907 -3.277286 -0.745703
H  1.845813 -2.668737 0.244926
H  -1.904392 0.035785 -1.727818
H  -1.025489 -0.064188 1.249717
H  -3.136975 -0.085597 1.941093
H  -4.211341 0.044211 -2.275908
H  -5.551039 -0.109393 2.55194
H  -6.637166 0.01997 -1.656032
H  -7.314289 -0.056644 0.764429
