program: Gaussian 09
title: 000230457
version: EM64L-G09RevD.01
frameworkgroup: C1[X(C22H20O2)]
method: RPBEPBE
basis: SDD
operation: Freq
keyword: #pfreq=noraman
keyword: PBEPBE/SDD
title: #p freq=noraman PBEPBE/SDD
converged: YES YES NO NO
title: Mulliken charges:
elementType: O O C C C C C C C C C C C C C C C C C C C C C C H H H H H H H H H H H H H H H H H H H H
charge: -0.401876 -0.241898 -0.300881 -0.335763 -0.616623 0.572282 0.507296 0.516129 0.121205 -0.417192 -0.427976 -0.392039 -0.414628 -0.416777 -0.411941 -0.250324 -0.222707 -0.237826 -0.226383 -0.244667 -0.231272 -0.228452 -0.243072 -0.244486 0.270075 0.258224 0.223906 0.216535 0.225206 0.228660 0.260801 0.226940 0.246722 0.233485 0.222806 0.223704 0.225049 0.225120 0.226498 0.222645 0.222368 0.228086 0.377358 0.225683
chargesum: 0.00000
title: Mulliken charges with hydrogens summed into heavy atoms:
elementType: O O C C C C C C C C C C C C C C C C C C C C C C
charge: -0.024518 -0.241898 -0.030806 -0.077539 -0.176181 0.572282 0.507296 0.516129 0.121205 -0.191986 -0.199316 -0.131238 -0.187688 -0.170054 -0.178456 -0.027517 0.000997 -0.012777 -0.001263 -0.018169 -0.008627 -0.006084 -0.014987 -0.018804
polarizability: 2.40004650e+02 8.79327523e+00 2.29689741e+02 -8.89458001e+00 -1.64860867e+01 2.09566952e+02
1716.lowfreq: -8.8375 -3.3061 -0.0007 -0.0006 -0.0004 2.2548 20.5271 22.9425 23.7723
frequency: 20.0551 22.6443 23.5184 31.9568 44.3992 47.8053 52.5196 66.5302 106.3389 134.0161 152.4910 187.5428 200.2094 221.2409 230.9086 279.9665 320.7690 345.6118 385.7353 401.9090 403.2250 404.5451 461.0216 492.2171 506.7124 527.3900 545.8566 575.8152 596.9699 614.1473 616.0866 618.0712 629.6099 638.9979 704.0217 704.8639 705.0999 709.5709 750.3369 766.3282 773.1665 781.2058 799.8867 849.5952 851.8888 853.0894 856.8889 895.7653 914.7371 920.0393 934.6475 950.7046 973.5081 975.7137 979.3973 989.8059 990.5299 991.0920 992.8970 994.2451 996.2111 1010.3142 1025.1643 1027.7326 1030.5995 1035.0637 1059.3438 1075.4744 1082.1972 1090.7773 1164.2030 1171.6792 1172.1891 1172.6317 1187.0803 1189.7729 1190.7545 1193.2135 1201.4868 1215.7109 1220.3439 1232.3673 1292.7523 1301.7206 1323.5655 1329.3246 1334.4272 1342.4975 1354.6352 1383.1435 1384.3264 1385.1636 1441.3005 1442.0054 1443.5203 1471.3000 1480.9377 1483.3080 1484.2200 1592.9720 1593.1782 1593.9071 1610.2114 1613.3719 1614.7151 1647.9310 2990.7865 3011.0997 3043.7573 3049.4469 3106.2663 3110.8912 3119.1549 3120.9972 3121.4697 3125.7866 3131.1516 3131.3612 3137.5716 3142.6590 3143.0440 3147.2810 3160.5760 3161.6023 3163.5188 3498.4503
redmass: 4.3640 4.7124 5.0570 4.2785 6.0154 4.8919 4.4751 5.2131 5.1982 6.4533 4.7438 5.7140 4.9569 4.5884 4.3031 5.8846 5.8722 2.2207 3.6571 2.8157 2.8082 2.8343 4.3195 3.3685 3.1756 3.3122 4.4146 3.3702 3.3170 5.7486 6.2263 6.2055 1.8051 3.8863 1.6955 2.0350 2.2399 2.3112 2.0730 1.9586 1.9520 2.9430 4.2681 1.3230 3.0316 1.2690 1.3076 2.3627 1.4590 1.4797 1.8166 2.2834 1.3935 1.3918 1.4151 5.9536 4.8269 5.4634 1.4091 1.3271 1.3608 4.1089 2.5297 2.2239 2.2744 2.7140 2.4094 1.6863 1.6212 1.6543 1.1780 1.0538 1.0653 1.0651 1.1205 1.1230 1.9828 1.1812 1.9146 2.3813 1.4600 1.5752 1.6077 1.3984 1.3788 1.3527 1.2709 1.3635 1.5508 7.8108 6.2161 6.3538 2.1783 2.1445 2.1582 1.1171 2.2338 2.3297 2.2597 6.0584 6.0642 6.0542 6.0269 6.1654 6.1204 8.0601 1.0598 1.0833 1.0898 1.0970 1.0871 1.0876 1.0860 1.0860 1.0847 1.0877 1.0912 1.0911 1.0921 1.0960 1.0957 1.0964 1.1015 1.1014 1.1016 1.0638
irintensity: 0.0079 0.2032 0.1327 0.0481 1.2831 1.7344 0.4769 0.1296 0.0333 1.3210 1.0675 1.5089 0.6211 0.6506 0.2761 1.1347 1.2962 0.6366 0.3566 0.0247 0.0157 0.0193 5.4998 1.2835 24.3348 9.0415 14.3724 48.8723 28.8607 3.9122 1.6710 1.3811 118.8255 5.1158 107.7620 42.7242 5.5343 44.0068 46.5087 0.5541 54.3280 9.5967 6.5473 0.1766 2.0700 0.1803 0.6151 6.1149 1.1600 4.1052 6.7128 6.6607 0.0273 0.3248 0.1353 0.2899 2.7056 1.8026 0.6743 0.2529 0.8680 36.1343 20.2061 1.9423 47.2676 25.3374 204.4479 19.1074 2.3029 4.3658 0.9159 0.0663 0.1649 0.0923 0.8658 0.2341 0.4297 0.9174 1.7318 3.9437 8.3964 5.4107 8.0112 7.2410 8.5495 8.8798 5.0660 15.2836 31.9754 0.5629 0.2800 2.0682 8.5664 3.4410 12.8210 8.4205 22.9220 16.2227 14.4742 0.8597 0.6362 5.3132 10.6356 6.7109 6.9767 159.8687 25.4704 4.5797 6.2782 25.7446 10.9877 6.4810 2.4333 1.9247 3.7842 0.6745 16.2919 9.0585 15.3055 28.4049 46.3612 32.1386 26.8261 22.9476 24.8892 26.1550
temp: 298.150 k
press: 1.00000 atm
elementType: 8 8 6 6 6 6 6 6 6 6 6 6 6 6 6 6 6 6 6 6 6 6 6 6 1 1 1 1 1 1 1 1 1 1 1 1 1 1 1 1 1 1 1 1
symmnumber: 1
zpe: 932019.4 jmol-1
zpe.correction: 0.354987 hartree
zpe.thermalcorrener: 0.375901 hartree
zpe.thermalcorrenthalpy: 0.376845 hartree
zpe.thermalcorrgfe: 0.301132 hartree
zpe.sumelectzpe: -999.117991 hartree
zpe.sumelectthermal: -999.097077 hartree
zpe.sumelectthermalent: -999.096133 hartree
zpe.sumelectthermalfe: -999.171846 hartree
dipole: 0.8482 0.9770 -0.7536
dipole: 1.4973
quadrupole: -137.1099 -132.2994 -130.2501
quadrupole: -0.8343 -1.4947 0.4871
quadrupole: -3.8901 0.9204 2.9697 -0.8343 -1.4947 0.4871
hfenergy: -999.4729782 hartree
pointgroup: C01 [X(C22H20O2)]
dipole: -0.3374761 -0.349922 -0.3327225 debye
polarizability: 240.2802408|8.5718831|225.3981276|8.5802686|18.4875049|213.5829754 unknown
InChI: InChI=1S/C22H20O2/c23-22(24)21(19-14-8-3-9-15-19)20(18-12-6-2-7-13-18)16-17-10-4-1-5-11-17/h1-15,20-21,23H,16H2
charge 0 multiplicity 1
44 atoms
O  -1.822063 3.304187 -1.435865
O  -0.794627 3.197551 0.640183
C  0.160286 0.485158 -0.213373
C  -1.222341 1.103848 -0.630213
C  1.347041 1.1878 -0.956538
C  0.17086 -1.02678 -0.44256
C  -2.395856 0.470272 0.134509
C  2.691721 0.889625 -0.308674
C  -1.229983 2.606787 -0.37506
C  0.030254 -1.568898 -1.747293
C  0.328185 -1.921045 0.6434
C  -2.540734 0.661842 1.532762
C  -3.334608 -0.338464 -0.550144
C  3.07369 1.581928 0.870833
C  3.574203 -0.084367 -0.839179
C  0.044969 -2.96453 -1.959141
C  0.345252 -3.319367 0.438055
C  -3.603101 0.047204 2.230509
C  -4.396594 -0.95572 0.148172
C  0.202909 -3.847342 -0.864932
C  4.307086 1.309429 1.502435
C  4.809807 -0.360516 -0.209753
C  -4.534174 -0.765247 1.541966
C  5.180936 0.335791 0.963326
H  0.285388 0.682789 0.868076
H  -1.382999 0.953602 -1.71214
H  1.17688 2.280797 -0.938345
H  1.350848 0.875237 -2.017562
H  -0.090369 -0.89989 -2.609378
H  0.438194 -1.517888 1.657224
H  -1.832782 1.303796 2.070125
H  -3.228827 -0.493422 -1.630418
H  2.4008 2.342468 1.288159
H  3.288589 -0.632882 -1.745033
H  -0.066164 -3.364253 -2.973823
H  0.469439 -3.993954 1.292711
H  -3.707122 0.204282 3.310144
H  -5.112547 -1.583477 -0.394034
H  0.215128 -4.93108 -1.02687
H  4.589836 1.857152 2.408886
H  5.480524 -1.116756 -0.6336
H  -5.357736 -1.242195 2.085137
H  -1.855975 4.274594 -1.210961
H  6.139776 0.124737 1.450377
