program: Gaussian 09
title: 000230456
version: EM64L-G09RevD.01
frameworkgroup: C1[X(C22H19N)]
method: RPBEPBE
basis: SDD
operation: Freq
keyword: #pfreq=noraman
keyword: PBEPBE/SDD
title: #p freq=noraman PBEPBE/SDD
converged: YES YES NO NO
title: Mulliken charges:
elementType: N C C C C C C C C C C C C C C C C C C C C C C H H H H H H H H H H H H H H H H H H H
charge: -0.012071 -0.297134 -0.272868 -0.626977 0.565570 0.511190 0.515209 -0.418192 -0.426312 -0.233615 -0.393216 -0.414355 -0.420920 -0.397745 -0.251600 -0.222231 -0.242250 -0.232561 -0.226303 -0.229184 -0.230402 -0.240666 -0.242951 0.258765 0.260724 0.243994 0.218570 0.228404 0.233211 0.243255 0.235039 0.236982 0.237081 0.226243 0.226632 0.229324 0.227711 0.227803 0.224114 0.223985 0.230465 0.227283
chargesum: 0.00000
title: Mulliken charges with hydrogens summed into heavy atoms:
elementType: N C C C C C C C C C C C C C C C C C C C C C C
charge: -0.012071 -0.038369 -0.012144 -0.164412 0.565570 0.511190 0.515209 -0.189787 -0.193101 -0.233615 -0.149961 -0.179317 -0.183938 -0.160664 -0.025357 0.004400 -0.012927 -0.004849 0.001500 -0.005070 -0.006417 -0.010201 -0.015668
polarizability: 2.31266269e+02 8.20035829e+00 2.46512243e+02 -2.28266106e+00 -1.49527809e+01 1.91361302e+02
1716.lowfreq: -12.3044 -0.0008 -0.0004 0.0004 4.2846 10.2843 16.0699 24.3495 34.1134
frequency: 11.6759 23.9924 34.0642 37.2534 43.3935 50.6981 71.3806 104.5659 128.5890 146.7216 187.0078 199.0040 219.6317 232.6989 320.7643 344.2807 348.9104 393.3827 401.7266 402.5634 404.7400 433.1406 491.5684 510.1907 521.7515 555.5707 578.5293 613.5536 616.2328 616.9750 621.1125 634.8464 702.5402 705.4362 707.2364 750.8796 763.2538 774.6726 778.1517 794.6580 840.4854 850.0543 853.1200 854.6248 910.8335 917.1616 917.9377 943.0425 962.0118 975.0587 976.0781 977.0522 990.1189 990.4230 991.4064 994.8655 995.4320 996.1893 1009.1158 1020.5927 1026.8428 1028.6306 1036.0163 1076.3355 1083.1948 1089.5511 1160.0281 1171.9550 1173.0927 1173.9461 1187.1048 1188.3423 1191.0750 1192.1142 1203.6287 1204.9401 1217.0840 1263.2638 1296.9059 1298.0539 1324.5499 1329.8317 1334.0490 1348.3917 1382.6475 1384.6536 1386.0894 1440.6538 1442.7999 1443.8884 1477.6594 1483.0056 1483.2045 1485.2360 1592.6926 1593.5127 1596.5247 1612.9680 1613.3338 1614.2929 2184.9186 2993.3867 2995.9003 3013.5381 3052.4984 3105.1315 3112.7999 3120.7400 3121.5173 3123.0269 3125.9634 3132.8746 3133.2832 3137.5762 3144.1191 3144.8507 3149.1822 3161.6293 3163.2228 3165.9324
redmass: 4.4188 5.1961 3.9164 4.4534 4.9614 4.3551 5.2947 5.7576 7.0648 4.9519 5.6534 4.6880 4.6528 4.3125 5.3212 2.4335 5.0179 3.5555 2.7949 2.8205 2.8185 7.3489 4.2374 3.5587 3.2788 4.0079 4.7531 4.7590 6.3675 6.3280 4.8152 6.1964 1.7098 1.7738 1.7092 2.0914 1.9311 1.9467 2.9669 4.1157 3.9763 1.2616 1.2503 1.2471 1.5889 1.4679 1.4458 2.0923 3.6343 1.4097 1.3946 1.3958 5.7681 5.7620 5.7594 1.3356 1.4123 1.3340 4.0795 3.0838 2.2062 2.2055 2.3927 1.6356 1.6106 1.5903 1.1800 1.0532 1.0605 1.0635 1.4905 1.1223 1.1506 1.1455 1.7184 2.1463 2.3822 1.5425 1.2016 1.5076 1.3466 1.2569 1.2863 1.3817 7.5832 7.3339 6.0940 2.1642 2.1464 2.1837 1.1797 2.1765 2.2082 2.1950 6.0234 5.9574 6.1673 6.1401 6.1302 6.1046 12.5706 1.0703 1.0713 1.0838 1.1020 1.0874 1.0873 1.0860 1.0866 1.0860 1.0870 1.0913 1.0909 1.0916 1.0961 1.0956 1.0961 1.1015 1.1014 1.1016
irintensity: 0.1753 0.4604 0.0520 0.1293 0.3113 0.2771 1.1324 0.3900 4.4883 2.0791 0.9261 0.0731 0.7456 0.0701 0.0468 0.2791 0.7092 0.0177 0.2054 0.0059 0.0116 2.2808 3.9407 3.9529 13.0497 29.1311 5.3981 11.4693 0.3399 0.3095 10.1434 1.4186 63.4641 64.7111 37.3282 49.2280 3.4636 50.8588 15.0421 2.4995 0.5453 0.2369 0.1189 0.1631 2.1261 3.5418 0.2507 4.7586 1.2808 0.1368 0.0408 0.1024 0.1909 0.3452 0.9237 0.3365 0.2660 0.2892 1.1518 4.0484 6.9334 5.2250 1.5563 17.1347 4.7090 5.6056 1.9947 0.1266 0.0945 0.0522 3.6612 0.9513 0.2647 0.6430 6.6812 2.2622 0.5454 0.6645 1.5344 2.8224 7.9405 0.3367 0.2067 2.4851 0.2093 0.3686 0.2085 7.9211 4.3552 14.3532 9.8879 29.6119 5.9651 11.5585 0.7235 1.6186 1.5081 1.7292 12.7982 3.2863 13.4066 9.8879 4.4232 16.8253 17.3167 12.1258 7.8192 1.7983 4.5720 1.9330 1.5244 16.4712 8.4133 12.3259 34.5185 37.7238 32.6878 23.9191 22.1229 21.2092
temp: 298.150 k
press: 1.00000 atm
elementType: 7 6 6 6 6 6 6 6 6 6 6 6 6 6 6 6 6 6 6 6 6 6 6 1 1 1 1 1 1 1 1 1 1 1 1 1 1 1 1 1 1 1
symmnumber: 1
zpe: 892157.8 jmol-1
zpe.correction: 0.339805 hartree
zpe.thermalcorrener: 0.359506 hartree
zpe.thermalcorrenthalpy: 0.360450 hartree
zpe.thermalcorrgfe: 0.287762 hartree
zpe.sumelectzpe: -902.891215 hartree
zpe.sumelectthermal: -902.871514 hartree
zpe.sumelectthermalent: -902.870570 hartree
zpe.sumelectthermalfe: -902.943258 hartree
dipole: 0.3558 4.2552 1.1999
dipole: 4.4354
quadrupole: -130.1567 -142.8347 -126.4688
quadrupole: 5.2355 0.7595 -12.4033
quadrupole: 2.9967 -9.6813 6.6846 5.2355 0.7595 -12.4033
hfenergy: -903.2310199 hartree
pointgroup: C01 [X(C22H19N1)]
dipole: -0.1762451 1.7221894 -0.2192725 debye
polarizability: 232.126172|-9.4742462|240.15683|-1.885448|21.9830111|196.8568127 unknown
InChI: InChI=1S/C22H19N/c23-17-22(20-14-8-3-9-15-20)21(19-12-6-2-7-13-19)16-18-10-4-1-5-11-18/h1-15,21-22H,16H2
charge 0 multiplicity 1
42 atoms
N  -0.920805 -3.919219 0.800292
C  0.133985 -0.555286 0.31658
C  -1.206055 -1.262608 0.791913
C  1.383413 -1.090683 1.093622
C  -0.004559 0.962911 0.43536
C  -2.405754 -0.851965 -0.076436
C  2.692412 -0.716906 0.411374
C  -0.178298 1.581429 1.701688
C  0.045267 1.785887 -0.714905
C  -1.049543 -2.732569 0.801152
C  -2.603701 -1.429717 -1.355348
C  -3.302996 0.143803 0.377321
C  3.207349 -1.537001 -0.626756
C  3.410711 0.452275 0.769684
C  -0.302365 2.983096 1.813185
C  -0.076536 3.190337 -0.609785
C  -0.25235 3.794779 0.65527
C  -3.680794 -1.0147 -2.168297
C  -4.380644 0.561065 -0.435604
C  4.407034 -1.19862 -1.291444
C  4.612009 0.794354 0.107987
C  -4.572347 -0.016003 -1.711569
C  5.11437 -0.029425 -0.925761
H  0.264611 -0.81601 -0.751256
H  -1.39922 -0.951776 1.838079
H  1.311115 -2.192235 1.160029
H  1.364033 -0.700428 2.128696
H  -0.210526 0.970223 2.613305
H  0.18132 1.323571 -1.699845
H  -1.928611 -2.219107 -1.708114
H  -3.156645 0.599398 1.363645
H  2.67037 -2.453086 -0.905083
H  3.024466 1.098458 1.567061
H  -0.435439 3.442981 2.799211
H  -0.033794 3.809546 -1.512776
H  -0.347081 4.883127 0.739771
H  -3.828661 -1.473242 -3.152384
H  -5.068125 1.3332 -0.073087
H  4.793857 -1.847363 -2.085673
H  5.155127 1.700734 0.399163
H  -5.409957 0.304188 -2.34114
H  6.047558 0.233488 -1.436629
