program: Gaussian 09
title: 000230454
version: EM64L-G09RevD.01
frameworkgroup: C1[X(C17H14N2)]
method: RPBEPBE
basis: SDD
operation: Freq
keyword: #pfreq=noraman
keyword: PBEPBE/SDD
title: #p freq=noraman PBEPBE/SDD
converged: NO YES NO NO
title: Mulliken charges:
elementType: N N C C C C C C C C C C C C C C C C C H H H H H H H H H H H H H H
charge: 0.005615 0.006280 -0.310731 -0.308121 0.524102 0.516918 -0.417504 -0.391265 -0.390585 -0.415102 0.436186 -0.384350 -0.391039 -0.197448 -0.195769 -0.231022 -0.221706 -0.802969 -0.236861 0.284225 0.284325 0.238179 0.247695 0.249318 0.239420 0.234498 0.234654 0.232248 0.231739 0.229238 0.228464 0.237217 0.234153
chargesum: 0.00000
title: Mulliken charges with hydrogens summed into heavy atoms:
elementType: N N C C C C C C C C C C C C C C C C C
charge: 0.005615 0.006280 -0.026506 -0.023796 0.524102 0.516918 -0.179326 -0.143570 -0.141268 -0.175682 0.436186 -0.149852 -0.156385 -0.197448 -0.195769 0.001226 0.010032 -0.108050 -0.002708
polarizability: 2.00115518e+02 -2.22832732e+01 2.08313215e+02 -2.62952407e+01 -1.37918246e+01 1.32447971e+02
1716.lowfreq: -16.1932 -0.0004 -0.0001 0.0005 5.5074 8.7579 10.4110 25.4861 33.3304
frequency: -14.9764 25.3359 33.3176 42.5214 49.5389 79.4455 111.7775 114.2758 150.6448 160.2194 176.7603 264.8368 286.8975 323.5489 347.2253 366.0932 388.9045 401.7664 404.7047 416.0757 471.7548 522.1160 529.3699 561.5984 581.3333 615.5462 636.5614 637.7301 702.9025 724.7375 760.7316 772.0754 811.8913 830.5167 836.6156 849.8946 853.3425 910.6644 930.0316 953.3045 976.0215 978.4886 987.7859 989.3184 992.2943 1000.5732 1004.3941 1015.3904 1029.6766 1048.1682 1085.9697 1126.4605 1175.6632 1186.7765 1192.8125 1194.2219 1198.7248 1203.4913 1224.5303 1248.4452 1273.3262 1286.0682 1320.3394 1337.5429 1380.2194 1385.5747 1398.9359 1411.2679 1444.8167 1471.5432 1473.8465 1483.6042 1508.1001 1588.0032 1596.9188 1612.7318 1624.6266 2191.3362 2191.8670 2978.0350 3009.0217 3025.1211 3060.1001 3089.9236 3117.4075 3119.5536 3121.8095 3125.6866 3138.1097 3138.2417 3144.5258 3150.9922 3167.4611
redmass: 1.0335 4.9683 3.7149 3.9073 6.7331 5.2063 9.4233 8.6333 5.7119 5.7621 4.8889 4.4979 4.3407 5.6981 5.0608 3.1493 6.9295 2.8124 2.8319 7.0268 7.2868 3.7710 3.5950 4.4652 4.9745 6.4372 6.6994 6.7291 1.7891 3.1628 2.2320 3.1757 2.0985 2.4745 4.2714 1.2752 1.2722 2.2827 2.2217 1.4415 1.3883 1.4211 2.1509 2.6892 3.6116 1.4614 3.3802 2.8792 2.1813 1.5690 1.6104 1.3329 1.0623 1.2802 1.4515 1.3241 1.3391 1.9030 2.9408 1.5322 1.7531 1.1800 1.3065 1.2754 5.3716 7.9542 1.2221 2.6884 2.1778 1.1014 1.0543 2.2546 2.6456 6.1599 6.1357 6.0404 6.3790 12.5895 12.5603 1.0390 1.0826 1.0840 1.0947 1.1000 1.0874 1.0877 1.0878 1.0874 1.0936 1.0939 1.0976 1.0959 1.1015
irintensity: 0.5073 0.0456 0.0297 0.0087 0.2200 0.5218 2.9422 3.1331 6.0560 1.4916 0.3556 1.7444 1.3180 0.2666 0.1425 0.1550 0.6988 0.1870 0.1830 2.3343 0.1369 6.9896 19.2081 16.7590 19.4667 0.2155 9.2178 4.1074 53.8633 3.8654 46.9146 3.0882 38.3048 12.0016 1.2122 0.4862 0.0455 1.0814 1.6572 1.5951 0.0209 0.1883 0.2564 0.0909 2.3495 0.0332 1.9856 3.4436 3.7496 15.3441 8.5455 9.0126 0.1135 4.2648 3.5449 2.3579 1.8178 1.1603 1.6968 0.0391 2.5105 0.3764 0.3597 0.5154 0.0445 0.1573 13.2242 2.6172 10.6297 15.3232 13.4926 12.8435 26.9550 0.1263 1.0964 1.9258 6.1795 2.6230 9.5442 29.9605 0.2625 5.0525 21.3829 15.7299 5.1573 16.0260 3.7939 2.8766 6.0904 28.5979 2.1636 26.5486 18.7176
temp: 298.150 k
press: 1.00000 atm
elementType: 7 7 6 6 6 6 6 6 6 6 6 6 6 6 6 6 6 6 6 1 1 1 1 1 1 1 1 1 1 1 1 1 1
symmnumber: 1
zpe: 675067.5 jmol-1
zpe.correction: 0.257120 hartree
zpe.thermalcorrener: 0.273672 hartree
zpe.thermalcorrenthalpy: 0.274617 hartree
zpe.thermalcorrgfe: 0.210819 hartree
zpe.sumelectzpe: -764.369886 hartree
zpe.sumelectthermal: -764.353333 hartree
zpe.sumelectthermalent: -764.352389 hartree
zpe.sumelectthermalfe: -764.416187 hartree
dipole: 4.2236 -6.8662 0.0167
dipole: 8.0613
quadrupole: -116.6705 -127.9677 -103.4849
quadrupole: 9.3271 -8.3584 -3.8731
quadrupole: -0.6295 -11.9267 12.5561 9.3271 -8.3584 -3.8731
hfenergy: -764.6270056 hartree
pointgroup: C01 [X(C17H14N2)]
dipole: 1.415836 2.8370977 0.0704718 debye
polarizability: 185.8914293|24.9361897|210.7961485|34.9247017|-11.7310993|144.1891265 unknown
InChI: InChI=1S/C17H14N2/c1-13-7-9-15(10-8-13)17(12-19)16(11-18)14-5-3-2-4-6-14/h2-10,16-17H,1H3
charge 0 multiplicity 1
33 atoms
N  0.171418 -4.09554 -0.0930
N  -3.546736 -2.426942 -0.075914
C  -0.140802 -1.47331 -0.497609
C  -1.380464 -0.921237 0.345027
C  1.144497 -0.707965 -0.15987
C  -1.661898 0.549995 0.012809
C  1.596794 0.330456 -1.006259
C  1.880192 -1.002371 1.014107
C  -2.345848 0.903537 -1.176951
C  -1.204083 1.570048 0.879479
C  3.500483 0.780979 0.492618
C  2.759894 1.062035 -0.683891
C  3.041044 -0.26722 1.332383
C  0.026297 -2.925695 -0.277812
C  -2.576628 -1.759376 0.116367
C  -2.56444 2.261242 -1.496025
C  -1.425049 2.929008 0.562212
C  4.738651 1.584351 0.849875
C  -2.103499 3.278332 -0.627593
H  -0.3864 -1.322786 -1.566163
H  -1.107752 -1.009145 1.413823
H  1.040418 0.570172 -1.92019
H  1.566199 -1.826972 1.666158
H  -2.731456 0.119793 -1.840815
H  -0.671595 1.303874 1.800248
H  3.098654 1.859124 -1.356477
H  3.605938 -0.517216 2.238574
H  -3.101395 2.525307 -2.413626
H  -1.069011 3.710942 1.241671
H  5.459917 0.980513 1.427682
H  5.251219 1.960174 -0.052766
H  4.476015 2.464134 1.469053
H  -2.278271 4.331765 -0.872425
