program: Gaussian 09
title: 000230453
version: EM64L-G09RevD.01
frameworkgroup: C1[X(C16H15ClN2O2)]
method: RPBEPBE
basis: SDD
operation: Freq
keyword: #p
keyword: freq=noraman
keyword: PBEPBE/SDD
title: #p freq=noraman PBEPBE/SDD
converged: YES YES NO NO
title: Mulliken charges:
elementType: Cl O O N N C C C C C C C C C C C C C C C C H H H H H H H H H H H H H H H
charge: -0.065014 -0.285111 -0.286073 -0.608829 -0.609465 -0.423473 -0.413155 0.513792 0.493318 0.237486 0.236097 -0.417530 -0.381213 -0.393013 -0.422667 -0.218288 -0.225115 -0.239005 -0.233852 -0.110490 -0.242945 0.258192 0.255822 0.261254 0.287195 0.278341 0.252640 0.254852 0.252451 0.224796 0.227132 0.322486 0.334180 0.322640 0.334195 0.228368
chargesum: 0.00000
title: Mulliken charges with hydrogens summed into heavy atoms:
elementType: Cl O O N N C C C C C C C C C C C C C C C C
charge: -0.065014 -0.285111 -0.286073 0.047837 0.047369 -0.165280 -0.157334 0.513792 0.493318 0.237486 0.236097 -0.156275 -0.094018 -0.114672 -0.170027 0.036563 0.027336 -0.014209 -0.006719 -0.110490 -0.014577
polarizability: 2.77827250e+02 2.15583679e+01 1.44216723e+02 1.10797107e+01 -2.40931212e+01 1.65632366e+02
1716.lowfreq: -10.2260 -2.9717 0.0009 0.0014 0.0021 12.5722 26.7258 34.0194 40.4431
frequency: 26.5248 33.9602 40.3107 41.6552 51.0403 56.0996 84.0872 115.1311 132.1496 146.5617 168.3930 187.8513 230.7092 258.5078 293.9111 323.8147 331.9610 347.8516 384.5202 405.4776 411.0950 463.8757 487.5296 507.6294 512.5404 532.7720 549.3669 576.9237 604.7319 608.6270 618.2137 625.1762 636.2304 665.0455 706.3861 713.4477 715.8994 729.3730 765.7726 816.9247 833.5450 842.1693 859.3361 864.4057 881.9197 926.4034 939.8281 955.2083 982.2745 982.7110 992.1116 999.5373 1001.2299 1029.1888 1042.0803 1057.1089 1066.0987 1072.6768 1084.7474 1110.1745 1172.5220 1187.6349 1189.8287 1193.8408 1194.0725 1208.9968 1239.8656 1249.8911 1296.9942 1308.5502 1337.8560 1359.6625 1365.9640 1380.2868 1383.5540 1404.9254 1443.1815 1474.8173 1481.1313 1582.8536 1587.4669 1590.9735 1593.3284 1597.2956 1610.5087 1633.9250 1639.2845 3017.6268 3031.9020 3121.7084 3128.5736 3139.4459 3140.6332 3145.5105 3148.1343 3163.0151 3167.7072 3173.2579 3516.3704 3516.6275 3671.9505 3671.9876
redmass: 6.3447 6.5587 4.1844 4.0275 4.2079 4.9019 7.8986 6.4632 8.1773 7.3407 6.5391 7.1320 5.3414 6.9822 5.6443 5.4286 5.2766 4.3670 6.3977 2.8582 2.9331 3.3374 2.8458 1.3148 1.4553 1.6929 3.1707 1.8089 3.8244 3.0107 4.7923 1.9740 4.8496 2.8385 2.0752 3.2742 4.1172 4.8377 1.9212 2.1536 1.7390 1.7004 1.3001 3.3687 3.4064 1.7997 2.1803 1.4251 1.4872 1.4614 3.8217 1.3564 3.9990 2.2261 4.6573 1.7897 2.0363 2.6105 1.6839 1.3964 1.0653 2.2569 1.1548 1.5110 1.5524 1.2731 1.5298 1.8335 1.3926 1.3973 1.3096 3.6418 2.9861 5.8375 6.1346 2.3706 2.1693 2.3538 2.2151 5.0912 2.7942 2.4627 2.2895 4.2610 5.6588 2.3831 2.6753 1.0831 1.0859 1.0847 1.0878 1.0925 1.0900 1.0895 1.0965 1.1016 1.0955 1.0965 1.0451 1.0451 1.1042 1.1042
irintensity: 1.9396 0.8127 4.9509 1.3319 2.3091 23.5345 1.4793 10.4455 9.6654 2.5605 3.3182 2.4366 0.9652 5.3893 0.7999 2.5622 1.5049 0.9682 11.0009 0.0248 0.1394 2.3437 2.5339 108.1873 21.5767 209.4217 34.7340 35.0400 37.2214 4.0460 19.9093 141.1863 2.2905 10.2974 67.8465 30.5165 24.8216 24.2775 42.1163 24.5375 3.6229 23.2140 0.3947 1.8896 3.7388 2.5412 1.9384 0.9697 0.6499 1.0543 0.1849 1.3554 45.4697 10.3246 0.0373 1.0101 0.8707 33.6073 11.3828 9.2170 0.1887 0.8534 1.6671 2.5914 1.2028 19.1330 37.6741 1.0173 0.0925 3.6414 14.4084 175.6394 59.3416 14.8804 12.3670 19.4047 10.3697 104.4175 30.8660 8.4682 47.4483 22.7768 7.4774 8.9317 7.7082 469.2614 1.7166 0.3632 20.2971 1.0096 4.5277 10.7416 0.5193 3.1747 25.7860 30.2425 4.3063 2.4476 63.4206 15.9393 48.6429 0.9271
temp: 298.150 k
press: 1.00000 atm
elementType: 17 8 8 7 7 6 6 6 6 6 6 6 6 6 6 6 6 6 6 6 6 1 1 1 1 1 1 1 1 1 1 1 1 1 1 1
symmnumber: 1
zpe: 729091.0 jmol-1
zpe.correction: 0.277696 hartree
zpe.thermalcorrener: 0.297159 hartree
zpe.thermalcorrenthalpy: 0.298103 hartree
zpe.thermalcorrgfe: 0.227291 hartree
zpe.sumelectzpe: -1337.260734 hartree
zpe.sumelectthermal: -1337.241272 hartree
zpe.sumelectthermalent: -1337.240328 hartree
zpe.sumelectthermalfe: -1337.311140 hartree
dipole: 2.8541 0.0885 0.2121
dipole: 2.8633
quadrupole: -137.1909 -126.9100 -114.7775
quadrupole: 4.4865 2.7517 13.0687
quadrupole: -10.8981 -0.6172 11.5153 4.4865 2.7517 13.0687
hfenergy: -1337.5384306 hartree
pointgroup: C01 [X(C16H15Cl1N2O2)]
dipole: 1.1130079 0.1520723 0.0845052 debye
polarizability: 274.0063586|33.8393294|132.5408208|-0.294999|2.4318134|181.1291594 unknown
InChI: InChI=1S/C16H15ClN2O2/c17-12-8-6-11(7-9-12)14(16(19)21)13(15(18)20)10-4-2-1-3-5-10/h1-9,13-14H,18-19H2
charge 0 multiplicity 1
36 atoms
Cl -6.16812 -0.672484 -0.310698
O  0.363782 1.543784 -2.104588
O  0.160506 -1.470419 2.126853
N  0.509893 3.002965 -0.310676
N  0.193415 -2.974748 0.364316
C  -0.150185 0.661036 0.14064
C  0.739189 -0.60976 -0.112098
C  -1.646992 0.349298 0.01054
C  2.237505 -0.294944 0.013179
C  0.266836 1.760554 -0.857076
C  0.333181 -1.70796 0.891386
C  -2.439216 0.202923 1.177136
C  -2.257416 0.170829 -1.258822
C  2.845395 -0.103775 1.282082
C  3.028795 -0.161005 -1.155692
C  -3.814781 -0.106587 1.089494
C  -3.63177 -0.137859 -1.363521
C  4.22042 0.205839 1.3750
C  4.403796 0.149662 -1.061108
C  -4.38935 -0.271288 -0.184383
C  5.005345 0.332888 0.205115
H  0.051612 0.987491 1.177284
H  0.534298 -0.942917 -1.146391
H  -1.972719 0.302274 2.163051
H  -1.659328 0.299894 -2.167637
H  2.243553 -0.22341 2.190432
H  2.558517 -0.274859 -2.139154
H  -4.421492 -0.221308 1.992092
H  -4.102882 -0.266864 -2.342398
H  4.680775 0.34266 2.360265
H  5.002047 0.251654 -1.973527
H  0.460761 3.171697 0.692141
H  0.777067 3.766561 -0.932418
H  0.322733 -3.164797 -0.627592
H  -0.045981 -3.742474 0.99217
H  6.072413 0.57135 0.279301
