program: Gaussian 09
title: 000230451
version: EM64L-G09RevD.01
frameworkgroup: C1[X(C11H13NO4)]
method: RPBEPBE
basis: SDD
operation: Freq
keyword: #p
keyword: freq=noraman
keyword: PBEPBE/SDD
title: #p freq=noraman PBEPBE/SDD
converged: NO YES NO NO
title: Mulliken charges:
elementType: O O O O N C C C C C C C C C C C H H H H H H H H H H H H H
charge: -0.398112 -0.264581 -0.243215 -0.269920 -0.612635 -0.307769 0.495532 -0.555366 -0.407957 -0.400850 0.131212 0.254300 -0.351702 -0.357587 0.317555 -0.537955 0.297541 0.253596 0.237092 0.257254 0.255961 0.251961 0.239282 0.317588 0.335031 0.377106 0.219059 0.221740 0.245840
chargesum: 0.00000
title: Mulliken charges with hydrogens summed into heavy atoms:
elementType: O O O O N C C C C C C C C C C C
charge: -0.021005 -0.264581 -0.243215 -0.269920 0.039983 -0.010228 0.495532 -0.064678 -0.150703 -0.144889 0.131212 0.254300 -0.099741 -0.118305 0.317555 0.148683
polarizability: 1.68254158e+02 1.10125619e+01 1.15984073e+02 -4.37877259e+00 9.59289549e+00 1.25641364e+02
1716.lowfreq: -11.9413 -4.0165 -2.5950 -0.0012 -0.0010 -0.0008 24.0950 31.4886 37.2561
frequency: 23.9934 31.2434 37.2216 42.9517 66.4945 99.1898 119.1492 133.2727 170.8738 223.0497 246.9286 255.6340 303.1808 344.0892 372.0325 414.2753 416.5987 469.8883 494.4717 507.6759 520.1979 547.3165 594.8480 599.2688 612.3200 631.9091 667.2748 678.4616 732.6765 756.0909 803.3923 817.9811 835.8530 851.5125 922.4047 947.0352 962.1378 970.0747 989.0629 1005.0859 1030.9887 1054.6604 1090.3079 1112.1164 1113.5210 1157.0334 1170.6641 1182.5317 1196.1952 1227.4104 1231.5848 1277.9806 1284.6017 1316.3577 1339.9422 1374.3360 1391.3465 1421.9282 1436.5407 1438.4252 1467.4968 1473.4059 1500.0088 1583.7283 1596.1579 1620.2833 1641.7891 1648.3445 2958.6246 2998.3938 3045.7628 3051.5589 3071.2272 3122.7938 3124.6951 3143.2821 3162.0337 3170.6888 3507.2011 3517.5097 3673.8487
redmass: 4.9422 3.8300 7.1489 8.1638 3.8771 4.9582 5.3967 3.8356 4.1056 1.8902 3.9922 1.8851 5.0324 4.8083 4.6517 3.0194 3.1450 2.3490 2.0813 2.6528 1.7884 2.5293 2.0271 1.8807 2.9270 4.9872 2.2110 2.6720 3.6038 5.2095 4.2958 1.3625 1.7882 2.8719 2.9872 1.4326 2.4142 1.4756 8.0661 2.6856 3.2282 1.7890 2.2953 1.2727 1.3658 1.3504 1.3874 1.2870 1.9917 1.3143 3.2446 1.6397 1.4635 1.4242 2.5794 2.6290 3.9197 2.8038 1.1725 1.1019 1.0502 1.0797 2.3567 6.9767 1.5045 6.2225 3.7207 6.2484 1.0330 1.0616 1.1038 1.0866 1.0972 1.0907 1.0980 1.0893 1.0933 1.0963 1.0639 1.0449 1.1042
irintensity: 1.1971 1.0931 11.9532 6.4310 5.2074 1.1711 11.4550 0.6228 4.4858 1.1919 1.6878 0.8146 2.2315 3.8400 0.6488 1.3116 2.9670 11.8643 31.3610 31.4775 119.0154 76.2057 136.4631 4.8895 63.7575 22.2361 81.7063 4.5266 10.4451 33.6684 5.2812 19.4613 46.2086 4.6953 1.8270 1.9228 22.8383 4.0736 31.0549 5.4899 137.3265 76.1968 71.0967 2.1227 11.9687 0.7333 2.8588 71.6196 2.3635 5.8935 163.0317 7.0240 10.9738 18.3461 150.8252 59.3728 16.3751 2.1085 4.6345 21.9014 13.3067 61.1144 111.5193 4.7193 50.9119 53.8598 402.8448 67.3902 66.3859 15.7545 49.6578 3.2959 16.7920 15.6713 14.3425 5.3022 12.7505 4.4330 24.8471 31.6723 23.9747
temp: 298.150 k
press: 1.00000 atm
elementType: 8 8 8 8 7 6 6 6 6 6 6 6 6 6 6 6 1 1 1 1 1 1 1 1 1 1 1 1 1
symmnumber: 1
zpe: 593015.4 jmol-1
zpe.correction: 0.225868 hartree
zpe.thermalcorrener: 0.241942 hartree
zpe.thermalcorrenthalpy: 0.242886 hartree
zpe.thermalcorrgfe: 0.179657 hartree
zpe.sumelectzpe: -781.441226 hartree
zpe.sumelectthermal: -781.425151 hartree
zpe.sumelectthermalent: -781.424207 hartree
zpe.sumelectthermalfe: -781.487437 hartree
dipole: 1.8230 0.1420 -3.8512
dipole: 4.2632
quadrupole: -86.4323 -85.4301 -92.7906
quadrupole: -1.5874 -2.2627 -11.9068
quadrupole: 1.7854 2.7875 -4.5730 -1.5874 -2.2627 -11.9068
hfenergy: -781.6670934 hartree
pointgroup: C01 [X(C11H13N1O4)]
dipole: 0.6987993 -0.1676417 1.515546 debye
polarizability: 168.6950091|-10.0817615|113.8619712|3.822368|8.5545078|127.3226136 unknown
InChI: InChI=1S/C11H13NO4/c1-16-8-4-2-7(3-5-8)9(11(14)15)6-10(12)13/h2-5,9,14H,6,12H2,1H3
charge 0 multiplicity 1
29 atoms
O  -2.163338 2.733827 -0.809383
O  4.003275 -0.307355 -0.234972
O  -2.324317 2.205807 1.443038
O  -2.474732 -2.188786 -1.194908
N  -2.126117 -3.059892 0.925602
C  -1.727125 0.439649 -0.193525
C  -0.197702 0.283004 -0.176323
C  -2.431473 -0.619026 0.696895
C  0.474214 -0.268496 -1.29833
C  0.564568 0.643368 0.960656
C  -2.105381 1.840431 0.263904
C  -2.336382 -2.008321 0.051453
C  1.868213 -0.454296 -1.285267
C  1.966533 0.466999 0.987998
C  2.620183 -0.084833 -0.141928
C  4.829487 0.070087 0.913512
H  -2.082169 0.304167 -1.229352
H  -3.506718 -0.368343 0.786456
H  -2.009621 -0.605434 1.716801
H  -0.10433 -0.565775 -2.17978
H  0.065376 1.079536 1.83491
H  2.394428 -0.881597 -2.144037
H  2.528648 0.763915 1.878487
H  -1.972124 -2.913231 1.921314
H  -2.084114 -4.006837 0.548458
H  -2.360236 3.648302 -0.466924
H  4.546419 -0.500139 1.819975
H  4.759156 1.155608 1.121599
H  5.859178 -0.184934 0.622865
