program: Gaussian 09
title: 000021809
version: EM64L-G09RevD.01
frameworkgroup: C1[X(C9Cl7N3O)]
method: RPBEPBE
basis: SDD
operation: Freq
keyword: #p
keyword: freq=noraman
keyword: PBEPBE/SDD
title: #p freq=noraman PBEPBE/SDD
converged: YES YES NO NO
title: Mulliken charges:
elementType: Cl Cl Cl Cl Cl Cl Cl O N N N C C C C C C C C C
charge: 0.069785 0.069795 0.072468 0.072469 0.078798 0.070744 0.075295 -0.211589 0.090208 0.027967 0.132043 0.761380 -0.316548 -0.316560 -0.086896 -0.086900 -0.123015 0.113784 -0.230000 -0.263228
chargesum: 0.00000
title: Mulliken charges with hydrogens summed into heavy atoms:
polarizability: 2.69011710e+02 -1.04597720e-02 1.82192089e+02 -3.17129165e+01 -8.58315855e-03 1.39346713e+02
1716.lowfreq: -2.0630 -0.0014 -0.0006 0.0017 2.6472 3.7340 10.9438 22.7140 29.4467
frequency: 10.8589 22.7131 29.4439 66.8936 69.0455 89.2632 132.1320 151.4101 156.5507 166.2189 168.0536 197.8028 201.2206 204.0710 213.5459 228.3688 297.9133 318.1377 320.9070 322.7363 335.8223 357.9650 392.1670 414.3224 436.7887 548.7367 563.9020 594.3786 611.7886 627.0974 656.7908 664.3456 666.0031 720.5391 783.3797 788.1845 804.5681 826.2793 868.4520 883.9087 963.7398 1066.7980 1187.7946 1202.9943 1226.4384 1232.5957 1331.9631 1338.4503 1339.1399 1354.2915 1424.9619 1452.2307 1542.7655 1547.0240
redmass: 27.2343 28.7073 27.2819 34.2255 28.8305 31.5831 16.6806 25.1545 14.4295 14.5128 15.0425 32.6613 30.6903 26.5148 34.7990 21.3648 22.5896 13.0241 18.7627 19.0401 20.1861 30.3121 22.2234 17.1817 16.6016 14.7804 12.9696 12.0912 13.0793 12.3836 13.2112 13.5279 13.1811 14.0294 12.3492 12.7611 13.3867 12.9685 13.4059 13.9131 13.5245 12.4707 12.6495 12.5418 12.4741 12.6128 12.0559 12.4678 12.0023 12.1570 12.8464 12.8485 12.0023 12.0164
irintensity: 0.0007 0.0026 0.0078 0.0010 0.0468 0.0346 0.0725 0.0837 0.0470 0.1652 0.2106 0.0491 0.1050 0.0065 0.0000 0.0687 0.3191 0.0921 0.0945 0.4409 0.5358 0.4375 2.2277 7.4234 4.9226 24.6387 0.9993 0.0922 8.1198 0.1423 21.7923 46.0683 6.8918 10.2998 20.5546 7.2438 143.5700 0.1176 42.3483 5.4585 191.1100 73.3939 197.2820 155.1795 61.2106 76.1087 156.3609 240.4842 8.4411 518.5267 538.2512 830.8548 0.4835 9.4931
temp: 298.150 k
press: 1.00000 atm
elementType: 17 17 17 17 17 17 17 8 7 7 7 6 6 6 6 6 6 6 6 6
symmnumber: 1
zpe: 204106.2 jmol-1
zpe.correction: 0.077740 hartree
zpe.thermalcorrener: 0.096701 hartree
zpe.thermalcorrenthalpy: 0.097646 hartree
zpe.thermalcorrgfe: 0.025803 hartree
zpe.sumelectzpe: -3801.384644 hartree
zpe.sumelectthermal: -3801.365683 hartree
zpe.sumelectthermalent: -3801.364739 hartree
zpe.sumelectthermalfe: -3801.436581 hartree
dipole: -1.3441 0.0005 0.3000
dipole: 1.3772
quadrupole: -166.5032 -157.6615 -166.4740
quadrupole: 0.0004 0.1854 0.0028
quadrupole: -2.9569 5.8847 -2.9278 0.0004 0.1854 0.0028
hfenergy: -3801.4623841 hartree
pointgroup: C01 [X(C9Cl7N3O1)]
dipole: -0.5279598 -0.0003615 -0.121757 debye
dipolederiv: -0.191514 0.2724676 -0.0724743 0.2663395 -0.4416907 0.0980345 -0.0660275 0.0859901 0.0029808 -0.1914571 -0.2724916 -0.0723285 -0.2663158 -0.4418256 -0.0978223 -0.065874 -0.0857628 0.0030784 -0.1694986 0.2591181 -0.0326559 0.3073992 -0.4842082 0.0647362 -0.0668667 0.0909768 0.0134116 -0.1694498 -0.2591314 -0.0325175 -0.3073971 -0.4843557 -0.064484 -0.0666977 -0.0907239 0.0134947 -0.6348372 -0.0000894 -0.17274 -0.0000856 0.0055869 -0.0000189 -0.2255624 -0.0000261 -0.0340609 -0.0860814 0.0000008 -0.0769237 0.0000108 -0.0259092 0.0010748 0.061812 0.0002238 -0.8596225 -0.8322422 -0.0005974 -0.3413683 -0.0016791 -0.0240532 -0.0008024 -0.3544588 -0.0002813 -0.222659 -2.1669284 -0.0001569 0.2973577 0.0001239 -0.2569006 -0.0000993 0.4042842 0.0000027 -0.4340846 -1.8820493 -0.0006078 0.0267984 -0.0001393 -0.1107585 -0.0002352 0.1430286 0.000278 -0.4887231 -1.0408195 -0.0003724 0.3527359 0.0002367 -0.0732735 -0.0001657 0.7666742 0.0000856 -1.2112343 -1.0102837 0.0001435 -0.5454129 -0.0008587 -0.0850276 0.0001014 -0.4618142 -0.0005735 -1.2962783 1.3126956 0.0001431 -0.1057176 0.0001019 -0.0826311 0.0000854 0.3218047 0.0001039 0.0975161 0.0791681 -0.4694686 0.1404053 -0.4946914 0.5417595 -0.1955846 0.0460022 -0.1393917 -0.0004075 0.0791055 0.4694892 0.1401283 0.4946781 0.5420013 0.1953226 0.045674 0.1390975 -0.000573 0.0045714 -0.4976351 -0.0142801 -0.5694361 0.6453252 -0.1559682 0.0192595 -0.1725767 -0.0125558 0.0044895 0.4975906 -0.0145529 0.5693755 0.6456112 0.1556309 0.0189318 0.1722336 -0.012727 0.902655 0.0001358 0.2779931 0.0001367 -0.2650091 0.0000975 0.3156536 0.000104 0.0636873 2.5583506 0.0001122 -0.3281844 -0.0001309 0.2498767 0.0001889 -0.9517984 0.0000671 1.1040862 1.2529164 0.0000215 0.1451149 0.0003109 0.0775215 -0.0008969 -0.2607248 -0.0005641 2.014758 2.1812091 0.0013281 0.4286223 0.0020211 0.0679607 0.0008056 0.3766997 0.000737 1.2599127 unknown
polarizability: 268.5555775|0.0443693|182.1920844|32.6288716|-0.0232252|139.8028499 unknown
InChI: InChI=1S/C9Cl7N3O/c10-1-2(11)4(13)6(5(14)3(1)12)20-9-18-7(15)17-8(16)19-9
charge 0 multiplicity 1
20 atoms
Cl -0.473855 -2.752891 0.82915
Cl -0.474053 2.75309 0.82769
Cl -3.537951 2.785274 -0.237518
Cl -3.53774 -2.78587 -0.236053
Cl -5.059031 -0.000494 -0.763238
Cl 2.5195 0.000936 -3.312188
Cl 5.565406 0.00235 1.10641
O  0.582564 0.000303 1.350612
N  2.882726 0.000024 1.178307
N  1.507503 -0.000462 -0.82312
N  3.917372 -0.000167 -1.014634
C  -0.705712 0.000074 0.757286
C  -1.364464 -1.22447 0.526037
C  -1.364556 1.224445 0.525392
C  -2.69704 1.22796 0.057743
C  -2.696947 -1.228337 0.058386
C  -3.363576 -0.000274 -0.174336
C  1.689791 0.000047 0.526492
C  2.663262 -0.000918 -1.527899
C  3.946903 -0.000619 0.345778
