program: Gaussian 09
title: 000230421
version: EM64L-G09RevD.01
frameworkgroup: C1[X(C10H14O4)]
method: RPBEPBE
basis: SDD
operation: Freq
keyword: #pfreq=noraman
keyword: PBEPBE/SDD
title: #p freq=noraman PBEPBE/SDD
converged: YES YES NO NO
title: Mulliken charges:
elementType: O O O O C C C C C C C C C C H H H H H H H H H H H H H H
charge: -0.447452 -0.263220 -0.400705 -0.240070 -0.395925 -0.394878 -0.402294 -0.576826 -0.568733 0.412765 0.098646 -0.638777 0.097883 0.202958 0.189511 0.213959 0.213178 0.214841 0.219983 0.211109 0.211437 0.251831 0.283599 0.198859 0.247322 0.301452 0.382823 0.376726
chargesum: 0.00000
title: Mulliken charges with hydrogens summed into heavy atoms:
elementType: O O O O C C C C C C C C C C
charge: -0.064629 -0.263220 -0.023980 -0.240070 0.007546 0.033141 0.028798 -0.113558 -0.086275 0.412765 0.098646 -0.090004 0.097883 0.202958
polarizability: 1.47438816e+02 9.61959789e+00 1.22555860e+02 -1.68437822e+00 -6.41002213e+00 9.23260689e+01
1716.lowfreq: -11.0186 -4.9355 0.0005 0.0005 0.0006 11.3443 24.0769 41.5228 57.9454
frequency: 23.9696 41.3214 57.9196 63.3758 66.9308 123.4591 163.3433 248.8141 280.5727 291.1888 327.4510 373.4602 392.7531 417.3664 440.0350 478.2844 490.4417 512.6771 565.5298 588.9994 612.0111 635.2134 680.3574 722.4157 771.1840 786.7057 814.3581 839.9082 853.2916 859.4305 896.2228 923.7453 945.3620 982.8848 1023.4821 1046.5211 1073.5467 1084.3871 1092.9006 1114.6871 1120.3600 1139.9592 1206.7846 1228.8705 1245.2689 1254.2724 1277.5711 1294.5935 1299.8512 1301.6449 1307.8417 1314.9316 1336.6047 1346.0201 1354.9796 1455.8453 1463.8665 1464.5509 1466.2715 1475.7044 1479.1856 1611.2591 1629.7981 1653.3953 2960.3668 2967.6781 2969.6347 2985.5828 2987.0685 3031.2826 3045.5938 3050.2175 3053.9240 3085.2340 3111.7747 3115.6255 3509.2573 3530.7073
redmass: 10.4049 6.7686 6.0724 3.6287 5.4200 4.1005 3.0396 3.7356 2.1317 4.3945 5.6503 3.4667 2.4988 3.0112 2.3458 2.5532 2.2572 2.7153 3.0294 1.3715 2.6839 1.6269 3.1435 4.0066 5.8368 1.4740 3.4157 4.4752 2.3064 1.7939 2.6322 1.3764 2.3590 2.8643 2.5308 2.4016 1.7857 1.2490 1.6131 2.1113 2.0372 1.7361 1.2829 1.3645 1.5396 1.2939 1.4995 2.2009 1.3945 1.3205 1.4851 2.1677 1.4611 1.5360 1.4466 1.1069 1.0894 1.0863 1.0853 1.0893 1.1072 6.6882 8.1236 8.2264 1.0686 1.0624 1.0678 1.0623 1.0610 1.0961 1.1026 1.0593 1.1031 1.0938 1.0924 1.1028 1.0640 1.0641
irintensity: 1.5864 1.4954 0.3620 0.1753 0.1460 0.0433 0.5102 1.7108 0.7756 0.7730 3.8172 2.6053 3.1911 0.7997 7.2145 4.0989 5.5921 44.9575 62.9232 73.5546 26.4943 129.7403 57.0501 5.1585 8.0335 0.9918 1.9759 34.0173 2.7405 16.1133 3.7576 3.6863 32.2212 145.2261 84.3925 95.3658 221.4319 54.5382 7.2871 18.2445 45.3621 20.0313 20.1210 2.1391 1.9370 5.6237 1.5402 21.6173 13.8760 29.2955 12.4710 52.2111 4.1759 0.6020 14.6276 17.8534 7.2281 12.9032 14.4524 18.2474 13.4497 160.6433 129.6327 251.5436 8.3035 30.4986 48.8109 25.8301 36.4481 55.1814 26.6791 10.5468 82.4242 17.0138 3.1921 4.2830 23.9335 46.0525
temp: 298.150 k
press: 1.00000 atm
elementType: 8 8 8 8 6 6 6 6 6 6 6 6 6 6 1 1 1 1 1 1 1 1 1 1 1 1 1 1
symmnumber: 1
zpe: 597175.1 jmol-1
zpe.correction: 0.227452 hartree
zpe.thermalcorrener: 0.241323 hartree
zpe.thermalcorrenthalpy: 0.242267 hartree
zpe.thermalcorrgfe: 0.184963 hartree
zpe.sumelectzpe: -689.289851 hartree
zpe.sumelectthermal: -689.275981 hartree
zpe.sumelectthermalent: -689.275036 hartree
zpe.sumelectthermalfe: -689.332340 hartree
dipole: 0.7241 0.1218 -0.1845
dipole: 0.7571
quadrupole: -73.6462 -92.8459 -78.6502
quadrupole: 2.6465 -2.8894 5.0535
quadrupole: 8.0679 -11.1318 3.0639 2.6465 -2.8894 5.0535
hfenergy: -689.5173034 hartree
pointgroup: C01 [X(C10H14O4)]
dipole: 0.2735071 0.1033919 -0.0567398 debye
polarizability: 141.9093865|14.7944678|126.579578|3.0312504|-8.1845745|93.8317798 unknown
InChI: InChI=1S/C10H14O4/c11-9(12)6-8(10(13)14)7-4-2-1-3-5-7/h11,13H,1-6H2
charge 0 multiplicity 1
28 atoms
O  -2.208458 -2.290004 -0.451278
O  -0.258461 -2.706287 0.710055
O  -2.531336 0.884576 0.954008
O  -1.800156 2.611386 -0.411598
C  3.181173 1.135182 0.550596
C  1.993624 1.928091 -0.039698
C  2.742825 -0.274493 1.006807
C  1.278848 1.127716 -1.17446
C  2.022903 -1.047136 -0.141551
C  0.845224 -0.234707 -0.654796
C  -0.479207 -0.628533 -0.624761
C  -1.597085 0.262609 -1.186286
C  -0.901538 -1.933768 -0.048497
C  -1.966523 1.384349 -0.227314
H  3.97458 1.038458 -0.21944
H  3.624517 1.691688 1.398841
H  2.334524 2.898864 -0.446447
H  1.257961 2.154231 0.75717
H  2.054027 -0.195435 1.870687
H  3.616771 -0.864102 1.342469
H  2.008556 0.977318 -1.99742
H  0.445855 1.73026 -1.568814
H  1.71925 -2.043036 0.207863
H  2.745972 -1.167805 -0.976155
H  -1.30568 0.727631 -2.140179
H  -2.492346 -0.355437 -1.355358
H  -2.438207 -3.15231 -0.012372
H  -2.742712 1.644196 1.562326
