program: Gaussian 09
title: 000230417
version: EM64L-G09RevD.01
frameworkgroup: C1[X(C8H13BrO2)]
method: RPBEPBE
basis: SDD
operation: Freq
keyword: #p
keyword: freq=noraman
keyword: PBEPBE/SDD
title: #p freq=noraman PBEPBE/SDD
converged: YES YES NO NO
title: Mulliken charges:
elementType: Br O O C C C C C C C C H H H H H H H H H H H H H
charge: -0.077744 -0.410257 -0.238843 -0.076814 -0.441475 -0.441748 -0.391380 -0.391257 -0.391962 -0.492463 0.179907 0.233566 0.246272 0.246356 0.233671 0.223988 0.201623 0.201618 0.223896 0.195208 0.208415 0.289693 0.289741 0.379989
chargesum: 0.00000
title: Mulliken charges with hydrogens summed into heavy atoms:
elementType: Br O O C C C C C C C C
charge: -0.077744 -0.030268 -0.238843 -0.076814 0.038363 0.038279 0.034231 0.034257 0.011661 0.086970 0.179907
polarizability: 1.18116760e+02 6.82821715e+00 1.15418584e+02 2.25966158e-03 -1.02681266e-02 8.26151096e+01
1716.lowfreq: -12.1231 -0.0001 0.0002 0.0005 1.2532 9.3869 38.6164 92.9567 101.7877
frequency: 38.5700 92.9526 101.7737 133.7239 160.2929 213.1497 241.8564 263.6833 305.0650 337.4016 346.7442 446.6587 451.4066 485.8776 505.6256 558.9382 641.8616 674.7928 745.8676 772.7030 836.2091 854.5726 861.6706 880.0870 913.5691 953.5576 970.6976 1040.9384 1051.9521 1084.9645 1100.9530 1121.3568 1141.4635 1145.0234 1166.0029 1237.7925 1259.5969 1263.9934 1280.8527 1296.9306 1323.9692 1339.4116 1340.1634 1342.0292 1345.4101 1364.6500 1425.3673 1441.1533 1447.5461 1461.8708 1467.0097 1472.9565 1658.0378 2969.6250 2971.3574 2974.5808 2989.4366 2989.6120 3011.0914 3035.1612 3040.5766 3045.4377 3049.3380 3057.1084 3064.1309 3508.1974
redmass: 8.3059 3.9340 3.7160 7.2957 2.8080 14.2410 2.7211 1.9199 5.9402 2.0968 1.8209 3.6710 3.2542 1.8641 1.8611 2.8998 1.4074 4.0237 3.1650 1.5188 3.0673 1.9334 2.3344 2.2981 1.3961 2.0307 2.5292 2.4189 2.0712 1.3175 1.4750 2.1184 1.8612 2.6981 1.2097 1.4009 1.4091 1.2912 1.3453 1.5342 1.3904 1.4067 1.7750 1.4719 1.6197 1.5041 1.0921 1.0831 1.0839 1.0841 1.0809 1.0897 7.9413 1.0615 1.0621 1.0619 1.0637 1.0606 1.0611 1.0974 1.0976 1.0978 1.1030 1.1033 1.0986 1.0640
irintensity: 0.5465 0.9157 1.4457 1.6302 0.4583 1.3254 6.4899 0.0210 2.8648 0.7343 4.6899 13.2056 0.0024 18.0098 27.0877 51.7882 132.1392 6.8687 17.0558 0.3081 2.5888 5.2879 0.0395 26.6044 9.4083 7.0431 33.8442 300.6229 16.4134 2.3808 0.0514 18.8332 1.1233 19.1251 0.0020 3.5306 10.0200 2.3368 7.1202 0.7419 2.3573 0.1012 53.1052 0.8097 53.7611 5.7494 37.1688 10.4785 5.3264 11.0400 16.3478 9.7680 198.8339 5.5312 31.8822 13.1898 18.3288 45.0949 10.5842 60.2374 61.6257 5.2894 0.1945 56.5525 3.2494 28.1080
temp: 298.150 k
press: 1.00000 atm
elementType: 35 8 8 6 6 6 6 6 6 6 6 1 1 1 1 1 1 1 1 1 1 1 1 1
symmnumber: 1
zpe: 521071.5 jmol-1
zpe.correction: 0.198466 hartree
zpe.thermalcorrener: 0.209952 hartree
zpe.thermalcorrenthalpy: 0.210896 hartree
zpe.thermalcorrgfe: 0.159960 hartree
zpe.sumelectzpe: -475.706654 hartree
zpe.sumelectthermal: -475.695168 hartree
zpe.sumelectthermalent: -475.694224 hartree
zpe.sumelectthermalfe: -475.745160 hartree
dipole: 1.6991 1.0826 -0.0006
dipole: 2.0147
quadrupole: -69.8164 -82.0856 -74.1446
quadrupole: -4.4958 0.0042 0.0028
quadrupole: 5.5325 -6.7368 1.2043 -4.4958 0.0042 0.0028
hfenergy: -475.9051199 hartree
pointgroup: C01 [X(C8H13Br1O2)]
dipole: -0.5237924 0.5943968 -0.0247188 debye
dipolederiv: -0.3434277 0.2355206 -0.0048182 0.2265095 -0.6930699 0.0067989 -0.0048646 0.0073205 -0.210535 -1.4000936 -0.2058427 -0.0698487 -0.2025354 -0.2988636 -0.0118061 -0.0695832 -0.0116603 -0.422625 -0.7656254 0.0589468 -0.0305164 -0.258831 -0.8927843 -0.0274415 -0.0362147 -0.0065136 -0.2985232 0.3778274 -0.4108232 0.0034172 -0.2883691 1.0141828 -0.0055383 0.0054524 -0.013705 0.224439 -0.084664 0.1211841 0.0127713 0.0075749 -0.1497783 -0.0707602 -0.0082561 -0.0171671 -0.0128773 -0.0832117 0.1184764 -0.0181806 -0.001766 -0.1525126 0.0662875 -0.0011289 0.0283771 -0.0117532 0.0863488 0.0050926 0.0199779 -0.0495383 0.121397 0.0077551 -0.0228631 0.0187954 0.0537905 0.0852325 0.0082435 -0.0154376 -0.0489677 0.1220489 -0.0118465 0.0254268 -0.0155564 0.0539547 0.0852479 -0.0619611 0.0021797 -0.0260079 0.1290844 -0.0001471 0.0027875 -0.0024246 0.0361793 -0.1429226 0.0326254 -0.0133074 0.2665575 -0.3880274 0.0104476 -0.010141 -0.0045879 0.0584413 1.737946 0.0754653 0.1053909 0.1853105 1.1770822 0.0289079 0.1078441 0.0211856 0.2071245 0.0196952 -0.0825338 0.0578222 -0.0757618 0.0188662 0.1169726 0.065434 0.0647272 -0.0661569 0.0625771 0.0227511 -0.0096656 0.0903046 -0.0456884 -0.0243634 0.0304138 -0.0616477 0.0777726 0.0653972 0.0145733 0.0083344 0.08758 -0.048721 0.0319803 -0.0294522 0.0599428 0.0780097 0.0346368 -0.071741 -0.0466066 -0.0578066 0.0251284 -0.1224392 -0.0538726 -0.0716725 -0.0872971 -0.0192789 0.0587351 -0.0092516 0.1097687 -0.0691835 0.0645498 0.0349635 0.02848 0.0785099 0.0381924 -0.0368446 -0.0253294 -0.0568836 0.0008574 -0.1261106 -0.0493631 -0.1048221 -0.1559398 0.025263 -0.0519947 0.0475502 -0.0754459 -0.0066423 0.1220487 0.0708389 0.103648 -0.1354781 -0.0142466 0.062114 -0.0010988 0.1190168 -0.0663038 -0.0541908 -0.0434115 -0.0252744 0.0709312 0.0276747 0.1576609 0.0031373 0.0780526 -0.1178087 0.002852 0.0017978 0.0080063 0.0202416 -0.2035262 -0.1194097 -0.0183766 -0.0733176 0.042395 -0.0048991 -0.0175874 -0.007925 0.0435492 0.053435 0.0124758 -0.033084 -0.0261099 0.0865101 -0.0460101 -0.0675337 -0.0646548 -0.0016132 0.0392037 0.0027351 0.0384702 -0.0342884 0.0829188 0.0444975 0.0719537 0.0681534 0.0159872 0.3183193 0.0545509 -0.0035298 0.104954 0.1089124 0.0024548 -0.0026405 -0.0010249 0.3838681 unknown
polarizability: 114.146799|-6.5245247|119.2509881|2.0022271|0.1921096|82.7526665 unknown
InChI: InChI=1S/C8H13BrO2/c9-8(6-7(10)11)4-2-1-3-5-8/h10H,1-6H2
charge 0 multiplicity 1
24 atoms
Br 1.070289 -2.468393 -0.052146
O  -3.60491 -0.16742 -0.326494
O  -2.007153 1.503068 -0.189652
C  0.161984 -0.558614 -0.079571
C  0.534963 0.139933 1.242428
C  0.703692 0.18284 -1.317108
C  2.0277 0.527789 1.340647
C  2.19544 0.570079 -1.204847
C  2.480465 1.341779 0.105395
C  -1.33676 -0.913237 -0.184843
C  -2.281153 0.282527 -0.229724
H  0.234865 -0.492521 2.098254
H  -0.078707 1.064406 1.278578
H  0.097874 1.109224 -1.403177
H  0.520312 -0.420003 -2.225607
H  2.641499 -0.389161 1.426689
H  2.186672 1.113768 2.265903
H  2.474423 1.18573 -2.081143
H  2.815973 -0.345715 -1.239524
H  1.941231 2.311142 0.086224
H  3.559978 1.573544 0.180389
H  -1.527577 -1.518305 -1.090603
H  -1.644373 -1.545716 0.668551
H  -4.215924 0.619152 -0.354221
