program: Gaussian 09
title: 000230413
version: EM64L-G09RevD.01
frameworkgroup: C1[X(C7H11ClO2)]
method: RPBEPBE
basis: SDD
operation: Freq
keyword: #p
keyword: freq=noraman
keyword: PBEPBE/SDD
title: #p freq=noraman PBEPBE/SDD
converged: NO YES NO NO
title: Mulliken charges:
elementType: Cl O O C C C C C C C H H H H H H H H H H H
charge: -0.089944 -0.414608 -0.230005 -0.133347 -0.409882 -0.418144 -0.405884 -0.398419 -0.377889 0.137227 0.286709 0.295083 0.229227 0.236562 0.246073 0.231383 0.208600 0.205260 0.207051 0.214404 0.380542
chargesum: 0.00000
title: Mulliken charges with hydrogens summed into heavy atoms:
elementType: Cl O O C C C C C C C
charge: -0.089944 -0.034066 -0.230005 0.153362 -0.114799 0.047645 0.071573 0.015441 0.043566 0.137227
polarizability: 9.70459637e+01 2.10128908e+00 7.59600305e+01 2.84073683e+00 1.66527199e+00 8.25315174e+01
1716.lowfreq: -20.6537 0.0024 0.0028 0.0031 7.1329 15.2644 32.8462 99.1734 130.3043
frequency: 32.6278 99.1207 130.3027 168.1779 200.3847 271.3611 302.8614 357.4283 385.4176 449.0483 466.2036 540.6792 583.2774 645.4451 672.4186 699.2543 774.8445 809.8740 850.1562 872.1374 896.6171 917.8329 994.6512 1042.6579 1057.3609 1062.4626 1081.9529 1116.2522 1144.9966 1163.7577 1195.8511 1236.3377 1260.6903 1266.7826 1280.1437 1321.5091 1330.0793 1338.9553 1348.8739 1357.5543 1361.4705 1449.9053 1462.8018 1468.5830 1475.0082 1645.1610 2970.4374 2986.4030 2988.3466 3003.7383 3018.3888 3037.7666 3049.2472 3060.8279 3074.1086 3087.9274 3511.5277
redmass: 9.9102 4.9937 3.9708 5.0102 3.3861 4.8403 2.9689 1.8883 3.7660 3.8222 2.2940 4.3223 1.6121 2.0409 3.4008 3.2970 2.4179 2.6174 2.0216 2.4251 2.1926 1.7874 2.8817 1.9395 1.8090 1.8696 1.7274 1.1613 1.2121 2.0379 1.2011 1.3424 1.3906 1.4395 1.3969 1.4142 1.9148 1.4661 1.4746 1.4793 1.5011 1.0808 1.0820 1.0838 1.0882 8.6188 1.0639 1.0630 1.0626 1.0647 1.0813 1.0949 1.1001 1.0998 1.1021 1.0885 1.0640
irintensity: 0.8266 1.3738 0.8710 2.8895 0.5713 0.7748 3.1431 0.5748 6.9693 3.2005 3.2429 60.5327 82.1229 49.3915 23.6239 23.5101 0.3976 0.5478 16.7492 6.1661 10.7261 20.9492 82.8863 144.9504 9.9613 59.2371 1.9433 7.7035 2.4235 4.3703 7.9198 1.7782 6.0296 1.8969 9.4398 1.5997 38.7869 3.5893 9.7036 6.8969 3.4681 17.4150 8.6378 16.8459 11.0051 201.8379 32.1262 9.9470 27.6662 12.8012 17.1091 48.6766 45.2944 20.4553 23.0588 11.3964 27.7345
temp: 298.150 k
press: 1.00000 atm
elementType: 17 8 8 6 6 6 6 6 6 6 1 1 1 1 1 1 1 1 1 1 1
symmnumber: 1
zpe: 450860.5 jmol-1
zpe.correction: 0.171724 hartree
zpe.thermalcorrener: 0.181581 hartree
zpe.thermalcorrenthalpy: 0.182525 hartree
zpe.thermalcorrgfe: 0.135622 hartree
zpe.sumelectzpe: -883.081364 hartree
zpe.sumelectthermal: -883.071507 hartree
zpe.sumelectthermalent: -883.070563 hartree
zpe.sumelectthermalfe: -883.117466 hartree
dipole: 1.7527 1.2644 -0.5092
dipole: 2.2203
quadrupole: -65.2301 -66.1327 -70.3167
quadrupole: -3.1952 -3.4091 -0.1556
quadrupole: 1.9964 1.0938 -3.0902 -3.1952 -3.4091 -0.1556
hfenergy: -883.2530881 hartree
pointgroup: C01 [X(C7H11Cl1O2)]
dipole: 0.5353074 -0.6756164 0.1416542 debye
dipolederiv: -0.4307652 0.1911446 0.1203188 0.1606623 -0.3881209 -0.1302855 0.1113205 -0.1658741 -0.3286555 -1.0304469 0.1148976 -0.4613425 0.1413992 -0.4281456 0.1135286 -0.4259841 0.0923878 -0.5272705 -0.6648472 0.0405176 0.1605271 0.0791912 -0.2916524 -0.0318351 -0.1147633 0.0897394 -0.9429928 -0.1791621 0.0171231 0.0924956 0.0146979 0.0182887 -0.0031982 0.2696347 -0.0526967 -0.2072633 0.5205493 -0.2706476 -0.1389309 -0.2338781 0.4436325 0.2144485 -0.1575067 0.2831742 0.3546806 0.0509918 0.0459476 -0.0391862 0.0969796 0.1039229 -0.0459678 -0.0722774 -0.0265167 0.1068086 -0.0312716 0.0436826 0.0156485 0.0035561 -0.0312146 -0.0405102 0.0096655 -0.092036 -0.0404863 0.0939372 -0.0365171 -0.0477967 -0.0351132 0.0575 0.0082511 -0.0474235 0.0325779 0.0618115 0.0890651 0.0003578 -0.0250859 -0.0184051 0.0745731 0.0484636 -0.0288981 0.0113751 0.077016 1.4357911 -0.1824832 0.1301049 -0.3011146 0.1856076 -0.0147753 0.2119289 -0.0957734 1.2828316 0.0224469 -0.0498601 -0.0222319 -0.0567259 -0.0065962 -0.0546168 -0.0655693 -0.0594959 0.0464849 -0.0010092 -0.0111278 0.0577911 -0.0101353 -0.0743803 0.023852 0.0398514 0.0391241 -0.010051 -0.0190744 0.0121298 0.1342651 -0.0049802 0.0233825 -0.0589939 0.0947034 -0.0465928 -0.0018976 -0.0382681 0.0365917 -0.1312955 0.0390327 0.0233717 0.0423526 -0.1022942 0.0355885 0.0106504 0.052871 -0.0100937 0.096445 0.0541717 0.0049497 -0.0678566 0.0981171 -0.0367227 0.0232997 -0.0538664 0.0411168 -0.129767 0.0524755 0.0151364 0.0743371 -0.0898718 0.0697582 0.015229 0.0380183 -0.0751007 0.0329476 -0.0614475 -0.1041798 0.116219 0.0177724 0.1371722 -0.0240754 -0.0824785 0.087829 0.0670777 0.0507481 0.0399206 -0.0495667 0.0876535 -0.0950278 -0.0348654 0.0152631 -0.0779042 -0.0683874 -0.102192 -0.0879339 -0.0927164 -0.096835 -0.1005143 -0.0190188 -0.0515241 0.041318 0.0687392 0.0920185 0.0564904 -0.027153 0.1117321 0.0090278 -0.019323 0.2637799 0.0410782 0.0876636 0.0390594 0.3654477 -0.0239771 0.1490438 -0.028675 0.1770874 unknown
polarizability: 93.9200092|-7.1441253|78.5378858|-3.2731232|2.7312342|83.0796164 unknown
InChI: InChI=1S/C7H11ClO2/c8-6-4-2-1-3-5(6)7(9)10/h5-6,9H,1-4H2
charge 0 multiplicity 1
21 atoms
Cl -1.967416 1.993361 0.640953
O  2.744767 -0.106703 0.574969
O  1.800767 0.158894 -1.524306
C  0.424558 0.551188 0.52036
C  -0.682217 1.05054 -0.436062
C  -0.057096 -0.642675 1.402003
C  -1.394684 -0.065589 -1.209724
C  -0.689803 -1.771083 0.55559
C  -1.856005 -1.231463 -0.306631
C  1.673146 0.189108 -0.278824
H  0.722887 1.376468 1.195296
H  -0.30993 1.836332 -1.110762
H  -0.810604 -0.246065 2.108385
H  0.794528 -1.017052 1.99632
H  -0.666586 -0.436942 -1.959399
H  -2.246889 0.362173 -1.767133
H  -1.051439 -2.572681 1.22708
H  0.078482 -2.229271 -0.101344
H  -2.273509 -2.038965 -0.936961
H  -2.671682 -0.880767 0.355355
H  3.547623 -0.325307 0.027835
