program: Gaussian 09
title: 000230410
version: EM64L-G09RevD.01
frameworkgroup: C1[X(C7H10O4)]
method: RPBEPBE
basis: SDD
operation: Freq
keyword: #pfreq=noraman
keyword: PBEPBE/SDD
title: #p freq=noraman PBEPBE/SDD
converged: YES YES NO NO
title: Mulliken charges:
elementType: O O O O C C C C C C C H H H H H H H H H H
charge: -0.426232 -0.239213 -0.420475 -0.243998 -0.210394 0.384640 -0.711516 -0.711620 -0.396983 0.101133 0.160092 0.280254 0.245924 0.219748 0.220607 0.219589 0.246716 0.220478 0.293335 0.385618 0.382298
chargesum: 0.00000
title: Mulliken charges with hydrogens summed into heavy atoms:
elementType: O O O O C C C C C C C
charge: -0.040615 -0.239213 -0.038178 -0.243998 0.069860 0.384640 -0.025238 -0.024837 -0.103648 0.101133 0.160092
polarizability: 1.26892515e+02 4.08253063e+00 9.54363353e+01 7.33607879e-03 4.23044201e-03 5.80404821e+01
1716.lowfreq: -8.0133 -0.0007 0.0003 0.0003 4.8694 13.4135 27.0404 44.7251 82.8642
frequency: 26.7838 44.7148 82.8577 148.9386 151.4431 206.2367 208.9527 237.9017 238.5257 286.3920 300.0667 352.9163 419.2972 478.5500 526.9919 574.4078 605.1261 641.4274 647.9605 702.3888 718.9708 748.6378 873.9085 903.5515 929.8889 952.1889 963.6711 1013.0964 1049.1135 1067.4512 1104.6981 1160.3311 1183.4538 1254.0406 1303.3069 1337.8816 1363.8048 1370.8389 1381.1124 1397.6650 1465.5292 1477.9902 1479.3187 1497.1670 1606.1151 1630.2634 1638.6650 2985.8200 2987.1913 3045.6660 3075.3847 3078.6710 3103.4617 3110.0912 3154.6331 3506.6426 3519.5253
redmass: 5.3404 9.5200 3.5818 5.5804 3.5439 1.3823 4.1128 1.9569 1.0964 4.0442 4.7696 7.1178 2.9646 2.9530 4.7582 3.5376 1.1976 1.3976 3.8971 3.4088 4.7793 7.0559 4.8707 2.9301 1.1914 1.5002 1.4255 2.2969 2.2265 2.3367 2.8387 1.8850 1.8510 1.8431 2.1995 1.2423 1.6585 1.1832 1.3123 1.3598 1.0425 1.0506 1.0464 1.0621 8.0709 7.9846 7.6947 1.0353 1.0358 1.0853 1.1000 1.0991 1.1002 1.0986 1.0902 1.0639 1.0641
irintensity: 1.1665 2.0090 0.0806 2.6104 0.4467 0.0782 0.3341 0.0012 0.3830 1.7403 0.3562 0.0253 6.6288 5.3908 46.9570 67.5257 204.0346 66.0656 9.9790 13.9609 7.4905 44.8695 25.5973 1.0660 4.9321 25.0782 0.0607 89.4097 113.4690 542.0852 2.8543 40.3231 15.6026 4.3683 108.7096 0.6320 3.7984 16.4435 29.3045 14.9339 3.7713 3.1146 10.3313 16.9374 266.5245 91.0131 61.9259 40.7063 24.4952 8.7728 19.1752 43.0846 1.0860 26.4805 1.3216 43.4492 52.6853
temp: 298.150 k
press: 1.00000 atm
elementType: 8 8 8 8 6 6 6 6 6 6 6 1 1 1 1 1 1 1 1 1 1
symmnumber: 1
zpe: 426598.1 jmol-1
zpe.correction: 0.162483 hartree
zpe.thermalcorrener: 0.174574 hartree
zpe.thermalcorrenthalpy: 0.175518 hartree
zpe.thermalcorrgfe: 0.123352 hartree
zpe.sumelectzpe: -572.787917 hartree
zpe.sumelectthermal: -572.775826 hartree
zpe.sumelectthermalent: -572.774882 hartree
zpe.sumelectthermalfe: -572.827048 hartree
dipole: -1.0085 -0.5437 0.0145
dipole: 1.1458
quadrupole: -51.4299 -74.2111 -64.8168
quadrupole: 0.0564 0.0333 0.0047
quadrupole: 12.0560 -10.7252 -1.3308 0.0564 0.0333 0.0047
hfenergy: -572.9503998 hartree
pointgroup: C01 [X(C7H10O4)]
dipole: 0.3722976 0.2458362 -0.0646266 debye
dipolederiv: -1.1287957 -0.3806909 0.144604 -0.2676252 -0.4029828 0.0614147 0.152311 0.0871443 -0.4157792 -0.6194504 0.1294999 0.081125 0.0632155 -0.9987841 -0.0666037 0.0756684 -0.0814819 -0.3364724 -1.0443091 -0.5976677 0.1068773 -0.5674266 -0.6734341 0.1190896 0.1103797 0.1269666 -0.4471829 -0.7777074 0.1295881 0.120687 0.061568 -0.8906919 -0.0521466 0.1175459 -0.0688601 -0.3337515 -0.1752592 -0.0819468 0.047849 -0.0733182 -0.034728 0.0105607 0.0469784 0.0112375 0.0443572 -0.1140467 0.1475716 0.0253587 0.4808583 0.3428573 -0.0845073 0.0494445 -0.0064689 -0.0644134 0.1060473 0.0066466 -0.0118836 -0.0662814 0.0008149 0.0537742 -0.079345 -0.0575342 0.0184883 0.1217894 0.0334421 -0.0376495 -0.091086 -0.002661 -0.018276 0.0165895 0.0482506 0.0031967 -0.6625824 -0.0785196 0.126564 0.0920215 -0.1404386 -0.0246378 0.1385878 0.0161407 -0.1336023 1.6332391 0.1344401 -0.3228678 -0.0741158 1.1584136 0.0895559 -0.337207 0.0401052 0.2887875 1.8492661 0.3461961 -0.3599057 0.1363658 1.2491131 0.0318562 -0.376797 -0.0174049 0.3229323 0.0568188 0.0762166 0.0012858 0.0231289 0.0435682 -0.005061 -0.0022548 -0.0172482 0.0378195 -0.0741885 0.0321851 0.087092 0.0796597 0.1002787 -0.0327468 0.0311584 -0.012081 0.0595272 0.07886 -0.0196239 0.0220383 -0.0396122 -0.181521 0.0192427 0.0420895 -0.010527 0.0623149 -0.0160931 -0.0248923 -0.1315822 -0.0436486 0.0855541 -0.0529895 -0.0912238 -0.0171436 -0.0759902 0.0480086 -0.019966 -0.0186015 -0.0475891 -0.1771127 -0.0350835 -0.0422421 -0.0169683 0.088829 -0.0884455 0.0424655 -0.0061055 0.0865301 0.0974204 -0.0022621 0.0564394 -0.0015485 0.0798508 0.0589871 -0.0223804 0.0649947 -0.0183917 0.0705098 0.094321 0.0229459 0.0551424 -0.1363536 0.1059137 -0.0143891 0.0173943 0.0040381 0.0301296 -0.0115958 0.0195194 -0.0071087 0.1788949 0.3419892 0.047251 0.0124789 0.1017588 0.1143297 -0.0438495 0.0169472 -0.0310441 0.3740043 0.2999586 0.1145736 0.0302467 0.1599501 0.2093648 -0.0500555 0.0324648 -0.0395679 0.384543 unknown
polarizability: 122.6054498|7.0900226|96.1742313|-14.7374836|1.0120227|61.5896514 unknown
InChI: InChI=1S/C7H10O4/c1-4(2)5(7(10)11)3-6(8)9/h3-4,8,10H,1-2H3
charge 0 multiplicity 1
21 atoms
O  2.598832 -0.517088 -0.699021
O  1.265475 -2.394418 -0.528743
O  -3.214683 -1.153104 0.63017
O  -2.504053 1.056526 0.603324
C  0.482003 1.324054 -0.074172
C  0.252452 -0.18161 -0.128377
C  0.904311 1.9007 -1.455376
C  1.490932 1.717306 1.042663
C  -0.94611 -0.809382 0.110461
C  1.370829 -1.145728 -0.460483
C  -2.230186 -0.162317 0.459378
H  -0.490191 1.775178 0.186538
H  1.896529 1.532538 -1.762981
H  0.947081 3.003101 -1.386637
H  0.170262 1.640426 -2.2397
H  1.542958 2.819424 1.108679
H  2.50133 1.332983 0.828141
H  1.166593 1.335271 2.027786
H  -0.986654 -1.902134 0.044079
H  3.275299 -1.21751 -0.90967
H  -4.077508 -0.714717 0.864444
