program: Gaussian 09
title: 000230409
version: EM64L-G09RevD.01
frameworkgroup: C1[X(C7H10O4)]
method: RPBEPBE
basis: SDD
operation: Freq
keyword: #pfreq=noraman
keyword: PBEPBE/SDD
title: #p freq=noraman PBEPBE/SDD
converged: YES YES NO NO
title: Mulliken charges:
elementType: O O O O C C C C C C C H H H H H H H H H H
charge: -0.428977 -0.226460 -0.423408 -0.241990 -0.500388 -0.371210 0.345459 -0.685994 -0.372864 0.104370 0.155168 0.230329 0.251173 0.218475 0.222775 0.221310 0.221316 0.214588 0.295722 0.389378 0.381227
chargesum: 0.00000
title: Mulliken charges with hydrogens summed into heavy atoms:
elementType: O O O O C C C C C C C
charge: -0.039599 -0.226460 -0.042182 -0.241990 -0.018886 0.070040 0.345459 -0.028779 -0.077141 0.104370 0.155168
polarizability: 1.26292180e+02 -1.35947335e+00 9.92198078e+01 -5.00121258e+00 -4.42332463e+00 5.50647563e+01
1716.lowfreq: -11.6952 -5.5376 0.0003 0.0008 0.0010 2.3384 30.4883 46.9389 52.0835
frequency: 29.5597 46.9077 52.0762 79.6963 122.1240 153.6457 195.5002 233.1265 269.4010 307.3536 337.8764 379.9292 447.9952 525.4055 559.0430 595.1188 616.0255 633.8718 695.6493 737.2479 746.5922 800.1193 876.6603 898.8111 909.3652 934.9387 1009.0826 1046.8696 1053.1553 1084.2961 1091.0824 1155.7829 1239.8049 1262.3515 1279.8614 1288.3000 1320.1130 1328.4586 1374.3346 1389.7086 1455.0334 1470.6089 1477.0186 1484.3002 1616.7874 1628.0341 1648.8101 2977.2455 2990.4381 3018.1794 3041.7605 3076.6500 3077.1877 3094.7334 3180.4857 3520.9184 3531.9354
redmass: 3.7114 10.7876 9.2409 1.7272 4.9488 5.8464 3.3785 1.1854 4.5112 3.5513 3.0914 7.7857 3.5705 3.5836 4.1469 1.2161 1.4526 3.8573 3.1723 2.5711 1.6800 2.7477 1.8715 1.7163 4.7744 1.4970 3.4176 2.2917 2.8028 2.0331 1.6095 1.7645 1.3520 1.6209 1.2945 1.2037 1.7543 1.6086 1.9338 1.2085 1.1630 1.0712 1.0421 1.0639 9.0812 7.6688 7.6519 1.0352 1.0590 1.0600 1.1002 1.1007 1.0999 1.1040 1.0912 1.0641 1.0643
irintensity: 0.3729 0.3386 2.5953 0.0171 0.1981 0.1726 0.0490 0.4600 2.1142 1.8785 2.2704 5.1824 12.3631 40.6925 44.2708 283.8694 7.2433 9.7857 12.2469 34.8020 26.9183 4.5987 4.3372 7.5173 6.6390 24.0713 186.8571 360.2100 55.9292 7.7504 147.3887 23.7277 0.3293 9.9268 10.7546 10.3304 59.2768 40.4848 22.8717 10.3358 13.7046 3.8190 12.7949 14.2460 314.8302 159.1572 2.6090 35.4280 17.7940 17.8523 2.9635 39.1209 39.3849 17.4523 1.9893 52.7454 45.9192
temp: 298.150 k
press: 1.00000 atm
elementType: 8 8 8 8 6 6 6 6 6 6 6 1 1 1 1 1 1 1 1 1 1
symmnumber: 1
zpe: 427051.1 jmol-1
zpe.correction: 0.162655 hartree
zpe.thermalcorrener: 0.174794 hartree
zpe.thermalcorrenthalpy: 0.175738 hartree
zpe.thermalcorrgfe: 0.122565 hartree
zpe.sumelectzpe: -572.791556 hartree
zpe.sumelectthermal: -572.779418 hartree
zpe.sumelectthermalent: -572.778474 hartree
zpe.sumelectthermalfe: -572.831647 hartree
dipole: -0.9973 -1.0656 0.6157
dipole: 1.5840
quadrupole: -63.7851 -60.8571 -64.8551
quadrupole: -1.2686 1.0610 -0.3793
quadrupole: -0.6193 2.3087 -1.6893 -1.2686 1.0610 -0.3793
hfenergy: -572.9542116 hartree
pointgroup: C01 [X(C7H10O4)]
dipole: 0.2408585 -0.4743331 -0.3246366 debye
dipolederiv: -0.2833435 0.0037474 -0.0097024 -0.1053119 -1.1680973 -0.2966781 -0.064239 -0.3443354 -0.5468618 -0.9691273 0.1730035 0.1908963 -0.0986379 -0.6167367 -0.0973999 0.0593792 -0.1505107 -0.3782016 -1.1040736 0.5668484 0.2541972 0.497081 -0.5814189 -0.094366 0.255711 -0.1223648 -0.4935448 -0.7504903 -0.1208172 -0.0194563 -0.0851531 -0.8227778 -0.186473 0.0069104 -0.1701837 -0.3665789 -0.0236058 0.0665967 -0.021054 0.2507741 -0.3388282 -0.0297956 -0.1397892 0.1090058 0.0446953 0.1772824 -0.0307977 0.0111537 -0.0523635 0.1979432 -0.0278887 0.1739228 -0.2205616 0.0708664 -0.1497582 -0.2202094 -0.0264757 -0.4567186 0.3249725 0.1007875 -0.1466995 0.1998338 0.0457145 0.0789367 0.0354719 -0.0019933 0.0486659 -0.0726908 -0.0316312 -0.0654739 0.0600387 0.062725 -0.6599029 0.13071 0.0486278 -0.1142485 -0.1396455 0.0445857 0.0333547 -0.033177 -0.1205913 1.377841 -0.0456701 -0.2057084 0.3796509 1.3153429 0.4011419 0.0017985 0.4778397 0.4231938 1.908001 -0.330133 -0.2477474 -0.040956 1.0788782 0.3160584 -0.1944565 0.3550428 0.3780571 0.0160283 0.0095066 0.1177952 0.0015358 0.0866059 0.0203678 0.093143 0.0069645 0.0082232 0.0123496 -0.0349993 -0.093928 -0.0294373 0.0562004 -0.0256606 -0.0316327 -0.0168243 0.0378723 -0.0597624 -0.032608 -0.1204892 -0.0679876 0.006961 -0.051461 -0.0876358 -0.0359384 -0.0094271 -0.0412946 -0.0047557 0.1341509 0.0312906 0.0199845 -0.0062699 0.0870754 0.0021085 -0.0378964 -0.0702695 -0.0851729 -0.1143217 -0.0270328 0.056275 -0.0374697 -0.0853562 -0.0736587 0.0188352 0.0818803 0.0575162 -0.0339145 0.076764 -0.1129188 0.1025972 -0.032235 0.124689 -0.033948 -0.0609887 0.0146668 0.1348552 -0.0411614 0.0745362 0.0194916 0.1353294 -0.035632 -0.0232998 0.0994083 0.0255852 0.0167194 -0.023849 0.0600228 -0.0484851 -0.0062613 -0.0683873 0.1528703 0.1211317 -0.0599484 0.0148812 0.0137311 0.3632926 -0.019904 0.0465615 -0.0073562 0.3887907 0.2997576 -0.1185411 -0.0284862 -0.1566358 0.2120987 -0.0515472 -0.0394067 -0.0565927 0.3785057 unknown
polarizability: 124.2058589|-5.0063436|98.2040582|-7.953949|12.0019762|58.1668273 unknown
InChI: InChI=1S/C7H10O4/c1-2-3-5(7(10)11)4-6(8)9/h4,8,10H,2-3H2,1H3
charge 0 multiplicity 1
21 atoms
O  -1.397743 -2.427402 -0.682797
O  -2.802736 -0.83156 0.243978
O  3.130582 -1.01487 -0.598052
O  2.328533 1.000051 0.239621
C  -0.646571 1.01052 0.728342
C  -0.968102 2.082034 -0.360634
C  -0.408991 -0.352893 0.121529
C  -1.223871 3.464858 0.27251
C  0.797894 -0.868781 -0.279756
C  -1.64395 -1.185474 -0.08091
C  2.094054 -0.167359 -0.164337
H  -1.50754 0.953375 1.418486
H  0.248207 1.338935 1.281792
H  -1.8570 1.762105 -0.937682
H  -0.116593 2.141779 -1.064345
H  -0.335117 3.814275 0.829657
H  -1.456969 4.217644 -0.502398
H  -2.076046 3.428107 0.97662
H  0.842034 -1.869305 -0.718251
H  -2.258828 -2.915524 -0.780217
H  3.997653 -0.532114 -0.518257
