program: Gaussian 09
title: 000230408
version: EM64L-G09RevD.01
frameworkgroup: C1[X(C7H9BrO4)]
method: RPBEPBE
basis: SDD
operation: Freq
keyword: #p
keyword: freq=noraman
keyword: PBEPBE/SDD
title: #p freq=noraman PBEPBE/SDD
converged: YES YES NO NO
title: Mulliken charges:
elementType: Br O O O O C C C C C C C H H H H H H H H H
charge: 0.051310 -0.233272 -0.256771 -0.209178 -0.256042 0.398959 -0.805118 -0.396872 0.115393 0.313041 -0.495229 -0.500590 0.243522 0.255286 0.306215 0.238678 0.250993 0.247031 0.239937 0.245995 0.246713
chargesum: 0.00000
title: Mulliken charges with hydrogens summed into heavy atoms:
elementType: Br O O O O C C C C C C C
charge: 0.051310 -0.233272 -0.256771 -0.209178 -0.256042 0.398959 -0.000096 -0.396872 0.115393 0.313041 0.241473 0.232055
polarizability: 1.41428701e+02 6.65146849e+00 1.19582051e+02 2.05607036e+00 1.48448004e+00 6.83432060e+01
1716.lowfreq: -2.5387 -1.6078 -0.0010 -0.0009 -0.0008 8.9636 18.8193 34.1828 53.6587
frequency: 18.5286 34.1501 53.6525 77.1595 88.5856 99.3923 122.7407 141.9260 146.5680 171.1946 184.4387 263.2334 276.0070 281.8913 311.4239 360.7316 366.9108 403.4497 582.3558 625.4560 705.3846 725.5920 734.1444 792.7972 887.3120 909.3038 966.3967 1034.1992 1037.6926 1102.9259 1111.9718 1113.2107 1148.9216 1150.4327 1206.5782 1246.5444 1379.4702 1419.8093 1419.9455 1445.8841 1451.7584 1453.2384 1460.3898 1463.0899 1476.3270 1589.2321 1609.2798 1632.6831 2977.5696 3006.8131 3007.9012 3051.4903 3109.5294 3112.3559 3147.9165 3156.1038 3156.5993
redmass: 5.4868 6.2892 4.3360 3.2225 1.1164 1.1874 1.0680 5.4343 3.3699 3.9529 5.7925 8.4483 4.1232 4.1863 3.6371 9.7628 9.4309 6.0179 4.8474 5.6752 6.2616 9.8706 6.6215 5.4212 7.6436 7.4322 4.3403 2.5667 1.5684 2.7579 1.2652 1.4393 1.4587 1.5045 6.9225 6.7722 1.1967 1.1948 1.1857 1.0992 1.0501 1.0508 1.0514 1.0506 1.0470 8.5131 8.2467 8.7860 1.0391 1.0296 1.0292 1.0961 1.1047 1.1050 1.0973 1.1048 1.1051
irintensity: 2.2712 2.6253 0.5390 0.4608 0.2952 0.0545 2.4397 1.3169 6.9018 1.7149 2.6521 0.5336 9.7002 13.6714 5.3082 17.6280 11.4118 9.6406 1.0303 11.9986 12.0532 11.9325 23.4440 18.3895 13.7675 7.1335 43.8775 112.7414 7.9318 185.0567 0.2689 28.6652 44.1842 15.7651 449.9509 121.2192 31.5539 24.2393 25.6691 38.6793 15.3520 15.2179 10.6901 10.5737 23.1863 85.8158 137.0771 95.4175 11.5926 33.0941 24.4636 6.7762 23.2188 18.8390 4.7909 13.1573 12.5453
temp: 298.150 k
press: 1.00000 atm
elementType: 35 8 8 8 8 6 6 6 6 6 6 6 1 1 1 1 1 1 1 1 1
symmnumber: 1
zpe: 394831.0 jmol-1
zpe.correction: 0.150383 hartree
zpe.thermalcorrener: 0.165179 hartree
zpe.thermalcorrenthalpy: 0.166123 hartree
zpe.thermalcorrgfe: 0.105357 hartree
zpe.sumelectzpe: -585.542611 hartree
zpe.sumelectthermal: -585.527815 hartree
zpe.sumelectthermalent: -585.526871 hartree
zpe.sumelectthermalfe: -585.587637 hartree
dipole: 0.0010 -0.0605 -1.7811
dipole: 1.7821
quadrupole: -58.5631 -78.8015 -83.3989
quadrupole: 1.3020 -6.4911 -0.0076
quadrupole: 15.0247 -5.2137 -9.8111 1.3020 -6.4911 -0.0076
hfenergy: -585.6929942 hartree
pointgroup: C01 [X(C7H9Br1O4)]
dipole: 0.0434637 -0.2994144 0.6324928 debye
dipolederiv: -0.0680627 -0.1341355 -0.0460399 -0.0070834 -0.5063976 -0.2280975 0.0260484 -0.2186889 -0.0931687 -1.0853189 0.0063504 -0.344485 -0.0323927 -0.287316 0.0904237 -0.6163773 0.0829574 -0.8734229 -1.3176671 0.2536063 0.2787235 0.5281459 -0.5672627 -0.2152352 0.4226699 -0.1736578 -0.4282083 -0.751095 -0.0550567 0.2805366 -0.0558122 -0.3347436 0.2245754 -0.1257152 0.0911352 -0.8342396 -0.7977138 -0.2780081 -0.0522235 -0.0531191 -0.7709704 -0.211269 0.0584331 -0.1709107 -0.3904328 0.0931832 -0.0501643 -0.0667873 -0.3491383 0.0005795 0.0740058 -0.2084539 0.0351532 -0.0149533 -0.2333217 0.0843152 0.0800527 0.0547816 -0.1167212 -0.0945293 0.0879646 -0.113749 -0.0256433 -0.7148191 0.1883184 0.1838596 0.1439767 0.7172619 0.3452558 0.1085197 0.3702821 -0.0068799 1.4085165 -0.0428331 -0.0277344 0.0798871 0.2704145 -0.3391495 0.6707529 -0.2173636 1.4143499 1.896348 -0.0022351 -0.2475853 -0.3797844 0.8564992 0.3257866 -0.4548714 0.2542848 0.4895206 0.6097707 0.0246465 0.1594528 0.0863327 0.2601013 0.035818 0.1019754 0.0351457 0.2627677 0.7204484 -0.0765354 -0.1061587 -0.0164468 0.227548 -0.0194303 -0.0782196 -0.0089922 0.282602 0.0742759 0.0701628 -0.0824873 0.1001946 -0.0109233 0.0083582 -0.0657809 0.0557607 0.050898 0.1238333 -0.030598 0.0719 0.0126013 0.0538073 0.0152726 0.0876291 -0.0244141 -0.0380655 0.0804704 -0.1033105 -0.0474722 -0.0561162 0.1054024 -0.00435 -0.0278641 0.0024385 0.1334363 0.0411818 0.0016249 -0.0489548 0.0093494 0.0940475 0.0625816 -0.1032493 0.0520126 -0.0584827 0.0015711 0.0410108 -0.0389168 -0.0552815 -0.1021111 -0.016684 0.0038452 0.0229065 0.0987017 -0.0425049 0.0169364 0.004677 0.0194369 0.0553928 -0.0715772 0.1146174 -0.0740509 0.0042196 0.0204304 0.0433838 0.0365655 0.1020958 -0.0164542 -0.0803818 0.063618 -0.0712185 0.0814607 -0.0223637 0.0283302 0.0149641 -0.073277 -0.0290014 0.1217735 0.018438 0.0792117 0.0285217 -0.0371626 0.0141911 -0.0018864 -0.0583506 0.100847 -0.0231475 -0.0839799 -0.0082428 -0.0829809 unknown
polarizability: 140.428778|-3.5720254|107.6866995|-8.9929178|22.0279703|81.2384805 unknown
InChI: InChI=1S/C7H9BrO4/c1-4(6(9)11-2)5(8)7(10)12-3/h1-3H3
charge 0 multiplicity 1
21 atoms
Br -0.124812 1.831709 1.037795
O  2.535718 -0.296813 0.987997
O  -2.777053 0.566053 0.894704
O  2.485737 0.325315 -1.261511
O  -2.379726 -1.481173 -0.120291
C  0.511913 -0.688659 -0.227936
C  0.415754 -2.047878 -0.890251
C  -0.515673 0.050916 0.291271
C  1.920517 -0.13508 -0.244546
C  -1.946354 -0.382391 0.317857
C  3.928411 0.21491 1.086763
C  -4.212256 0.19745 0.959771
H  1.04346 -2.772617 -0.336023
H  0.831036 -1.977432 -1.913684
H  -0.616178 -2.417169 -0.930656
H  4.26864 -0.097312 2.083225
H  3.924361 1.313689 0.993212
H  4.554147 -0.221044 0.290407
H  -4.696623 1.062115 1.43308
H  -4.342555 -0.716169 1.563633
H  -4.605866 0.022381 -0.05542
